PFR,UniProt Id,Entry Accession,Entry Description,Isoform Accession,Isoform Description,Isoform Sequence,Start,End,Length,Proteoform Sequence,Monoisotopic Mass,Average Mass,Sequence Modifications,PTMs,N-Terminal,C-Terminal,Star
1006,HMGN2_HUMAN,P05204,Non-histone chromosomal protein HMG-17,P05204,,MPKRKAEGDAKGDKAKVKDEPQRRSARLSAKPAPPKPEPKPKKAPAKKGEKVPKGKKGKADAGKEGNNPAENGDAKTDQAQKAEGAGDAK,1,89,89,PKRKAEGDAKGDKAKVKDEPQRRSARLSAKPAPPKPEPKPKKAPAKKGEKVPKGKKGKADAGKEGNNPAENGDAKTDQAQKAEGAGDAK,9256.01670469,9261.47728,,,,,1
1007,THIO_HUMAN,P10599,Thioredoxin,P10599-1,1,MVKQIESKTAFQEALDAAGDKLVVVDFSATWCGPCKMIKPFFHSLSEKYSNVIFLEVDVDDCQDVASECEVKCMPTFQFFKKGQKVGEFSGANKEKLEATINELV,1,104,104,VKQIESKTAFQEALDAAGDKLVVVDFSATWCGPCKMIKPFFHSLSEKYSNVIFLEVDVDDCQDVASECEVKCMPTFQFFKKGQKVGEFSGANKEKLEATINELV,11598.70092469,11606.30388,,,,,1
1010,S10AA_HUMAN,P60903,Protein S100-A10,P60903,,MPSQMEHAMETMMFTFHKFAGDKGYLTKEDLRVLMEKEFPGFLENQKDPLAVDKIMKDLDQCRDGKVGFQSFFSLIAGLTIACNDYFVVHMKQKGKK,1,96,96,PSQMEHAMETMMFTFHKFAGDKGYLTKEDLRVLMEKEFPGFLENQKDPLAVDKIMKDLDQCRDGKVGFQSFFSLIAGLTIACNDYFVVHMKQKGKK,11064.47058469,11071.91168,,,,,1
1011,NEDD8_HUMAN,Q15843,NEDD8,Q15843,,MLIKVKTLTGKEIEIDIEPTDKVERIKERVEEKEGIPPQQQRLIYSGKQMNDEKTAADYKILGGSVLHLVLALRGGGGLRQ,0,75,76,MLIKVKTLTGKEIEIDIEPTDKVERIKERVEEKEGIPPQQQRLIYSGKQMNDEKTAADYKILGGSVLHLVLALRGG,8554.66613469,8559.97098,,,,,1
1012,RL30_HUMAN,P62888,60S ribosomal protein L30,P62888,,MVAAKKTKKSLESINSRLQLVMKSGKYVLGYKQTLKMIRQGKAKLVILANNCPALRKSEIEYYAMLAKTGVHHYSGNNIELGTACGKYYRVCTLAIIDPGDSDIIRSMPEQTGEK,1,114,114,VAAKKTKKSLESINSRLQLVMKSGKYVLGYKQTLKMIRQGKAKLVILANNCPALRKSEIEYYAMLAKTGVHHYSGNNIELGTACGKYYRVCTLAIIDPGDSDIIRSMPEQTGEK,12644.70093469,12652.85798,,,,,3
1013,SH3L1_HUMAN,O75368,SH3 domain-binding glutamic acid-rich-like protein,O75368,,MVIRVYIASSSGSTAIKKKQQDVLGFLEANKIGFEEKDIAANEENRKWMRENVPENSRPATGYPLPPQIFNESQYRGDYDAFFEARENNAVYAFLGLTAPPGSKEAEVQAKQQA,1,113,113,VIRVYIASSSGSTAIKKKQQDVLGFLEANKIGFEEKDIAANEENRKWMRENVPENSRPATGYPLPPQIFNESQYRGDYDAFFEARENNAVYAFLGLTAPPGSKEAEVQAKQQA,12635.33760469,12643.05928,,,,,1
1015,B2MG_HUMAN,P61769,Beta-2-microglobulin,P61769,,MSRSVALAVLALLSLSGLEAIQRTPKIQVYSRHPAENGKSNFLNCYVSGFHPSDIEVDLLKNGERIEKVEHSDLSFSKDWSFYLLYYTEFTPTEKDEYACRVNHVTLSQPKIVKWDRDM,20,118,99,IQRTPKIQVYSRHPAENGKSNFLNCYVSGFHPSDIEVDLLKNGERIEKVEHSDLSFSKDWSFYLLYYTEFTPTEKDEYACRVNHVTLSQPKIVKWDRDM,11723.78730469,11731.16798,,,,,1
1018,CX7A2_HUMAN,P14406,Cytochrome c oxidase subunit 7A2; mitochondrial,P14406,,MLRNLLALRQIGQRTISTASRRHFKNKVPEKQKLFQEDDEIPLYLKGGVADALLYRATMILTVGGTAYAIYELAVASFPKKQE,23,82,60,FKNKVPEKQKLFQEDDEIPLYLKGGVADALLYRATMILTVGGTAYAIYELAVASFPKKQE,6717.58107469,6721.81428,,,,,3
1019,DPM3_HUMAN,Q9P2X0,Dolichol-phosphate mannosyltransferase subunit 3,Q9P2X0-1,1,MTKLAQWLWGLAILGSTWVALTTGALGLELPLSCQEVLWPLPAYLLVSAGCYALGTVGYRVATFHDCEDAARELQSQIQEARADLARRGLRF,0,91,92,MTKLAQWLWGLAILGSTWVALTTGALGLELPLSCQEVLWPLPAYLLVSAGCYALGTVGYRVATFHDCEDAARELQSQIQEARADLARRGLRF,10087.23565469,10093.71998,,,,,1
1021,COX5A_HUMAN,P20674,Cytochrome c oxidase subunit 5A; mitochondrial,P20674,,MLGAALRRCAVAATTRADPRGLLHSARTPGPAVAIQSVRCYSHGSQETDEEFDARWVTYFNKPDIDAWELRKGINTLVTYDMVPEPKIIDAALRACRRLNDFASTVRILEVVKDKAGPHKEIYPYVIQELRPTLNELGISTPEELGLDKV,41,149,109,SHGSQETDEEFDARWVTYFNKPDIDAWELRKGINTLVTYDMVPEPKIIDAALRACRRLNDFASTVRILEVVKDKAGPHKEIYPYVIQELRPTLNELGISTPEELGLDKV,12493.42618469,12501.17128,,,,,1
1022,HMGN1_HUMAN,P05114,Non-histone chromosomal protein HMG-14,P05114,,MPKRKVSSAEGAAKEEPKRRSARLSAKPPAKVEAKPKKAAAKDKSSDKKVQTKGKRGAKGKQAEVANQETKEDLPAENGETKTEESPASDEAGEKEAKSD,1,99,99,PKRKVSSAEGAAKEEPKRRSARLSAKPPAKVEAKPKKAAAKDKSSDKKVQTKGKRGAKGKQAEVANQETKEDLPAENGETKTEESPASDEAGEKEAKSD,10521.55253469,10527.70988,,,,,1
1028,ATPD_HUMAN,P30049,ATP synthase subunit delta; mitochondrial,P30049,,MLPAALLRRPGLGRLVRHARAYAEAAAAPAAASGPNQMSFTFASPTQVFFNGANVRQVDVPTLTGAFGILAAHVPTLQVLRPGLVVVHAEDGTTSKYFVSSGSIAVNADSSVQLLAEEAVTLDMLDLGAAKANLEKAQAELVGTADEATRAEIQIRIEANEALVKALE,22,167,146,AEAAAAPAAASGPNQMSFTFASPTQVFFNGANVRQVDVPTLTGAFGILAAHVPTLQVLRPGLVVVHAEDGTTSKYFVSSGSIAVNADSSVQLLAEEAVTLDMLDLGAAKANLEKAQAELVGTADEATRAEIQIRIEANEALVKALE,15010.73945469,15019.92938,,,,,1
1043,RS27A_HUMAN,P62979,Ubiquitin-40S ribosomal protein S27a,P62979,,MQIFVKTLTGKTITLEVEPSDTIENVKAKIQDKEGIPPDQQRLIFAGKQLEDGRTLSDYNIQKESTLHLVLRLRGGAKKRKKKSYTTPKKNKHKRKKVKLAVLKYYKVDENGKISRLRRECPSDECGAGVFMASHFDRHYCGKCCLTYCFNKPEDK,76,155,80,AKKRKKKSYTTPKKNKHKRKKVKLAVLKYYKVDENGKISRLRRECPSDECGAGVFMASHFDRHYCGKCCLTYCFNKPEDK,9411.88531469,9418.08878,,,,,1
1046,RL38_HUMAN,P63173,60S ribosomal protein L38,P63173,,MPRKIEEIKDFLLTARRKDAKSVKIKKNKDNVKFKVRCSRYLYTLVITDKEKAEKLKQSLPPGLAVKELK,1,69,69,PRKIEEIKDFLLTARRKDAKSVKIKKNKDNVKFKVRCSRYLYTLVITDKEKAEKLKQSLPPGLAVKELK,8081.69137469,8086.69548,,,,,3
1064,CX6A1_HUMAN,P12074,Cytochrome c oxidase subunit 6A1; mitochondrial,P12074,,MAVVGVSSVSRLLGRSRPQLGRPMSSGAHGEEGSARMWKTLTFFVALPGVAVSMLNVYLKSHHGEHERPEFIAYPHLRIRTKPFPWGDGNHTLFHNPHVNPLPTGYEDE,24,108,85,SSGAHGEEGSARMWKTLTFFVALPGVAVSMLNVYLKSHHGEHERPEFIAYPHLRIRTKPFPWGDGNHTLFHNPHVNPLPTGYEDE,9612.74298468999,9618.79678,,,,,1
1068,COX7B_HUMAN,P24311,Cytochrome c oxidase subunit 7B; mitochondrial,P24311,,MFPLVKSALNRLQVRSIQQTMARQSHQKRTPDFHDKYGNAVLASGATFCIVTWTYVATQVGIEWNLSPVGRVTPKEWRNQ,24,79,56,SHQKRTPDFHDKYGNAVLASGATFCIVTWTYVATQVGIEWNLSPVGRVTPKEWRNQ,6358.19221469,6362.14888,,,,,1
1090,SSRD_HUMAN,P51571,Translocon-associated protein subunit delta,P51571,,MAAMASLGALALLLLSSLSRCSAEACLEPQITPSYYTTSDAVISTETVFIVEISLTCKNRVQNMALYADVGGKQFPVTRGQDVGRYQVSWSLDHKSAHAGTYEVRFFDEESYSLLRKAQRNNEDISIIPPLFTVSVDHRGTWNGPWVSTEVLAAAIGLVIYYLAFSAKSHIQA,23,172,150,EACLEPQITPSYYTTSDAVISTETVFIVEISLTCKNRVQNMALYADVGGKQFPVTRGQDVGRYQVSWSLDHKSAHAGTYEVRFFDEESYSLLRKAQRNNEDISIIPPLFTVSVDHRGTWNGPWVSTEVLAAAIGLVIYYLAFSAKSHIQA,16755.42178469,16765.86878,,,,,1
1101,ATP5E_HUMAN,P56381,ATP synthase subunit epsilon; mitochondrial,P56381,,MVAYWRQAGLSYIRYSQICAKAVRDALKTEFKANAEKTSGSNVKIVKVKKE,1,50,50,VAYWRQAGLSYIRYSQICAKAVRDALKTEFKANAEKTSGSNVKIVKVKKE,5645.06672469,5648.56968,,,,,1
1110,NDUB2_HUMAN,O95178,NADH dehydrogenase [ubiquinone] 1 beta subcomplex subunit 2; mitochondrial,O95178,,MSALTRLASFARVGGRLFRSGCARTAGDGGVRHAGGGVHIEPRYRQFPQLTRSQVFQSEFFSGLMWFWILWRFWHDSEEVLGHFPYPDPSQWTDEELGIPPDDED,33,104,72,AGGGVHIEPRYRQFPQLTRSQVFQSEFFSGLMWFWILWRFWHDSEEVLGHFPYPDPSQWTDEELGIPPDDED,8636.05538468999,8641.51028,,,,,1
1121,S10AB_HUMAN,P31949,Protein S100-A11,P31949,,MAKISSPTETERCIESLIAVFQKYAGKDGYNYTLSKTEFLSFMNTELAAFTKNQKDPGVLDRMMKKLDTNSDGQLDFSEFLNLIGGLAMACHDSFLKAVPSQKRT,0,104,105,MAKISSPTETERCIESLIAVFQKYAGKDGYNYTLSKTEFLSFMNTELAAFTKNQKDPGVLDRMMKKLDTNSDGQLDFSEFLNLIGGLAMACHDSFLKAVPSQKRT,11732.82494469,11740.44498,,,,,1
1128,DBLOH_HUMAN,Q9NR28,Diablo homolog; mitochondrial,Q9NR28-1,1,MAALKSWLSRSVTSFFRYRQCLCVPVVANFKKRCFSELIRPWHKTVTIGFGVTLCAVPIAQKSEPHSLSSEALMRRAVSLVTDSTSTFLSQTTYALIEAITEYTKAVYTLTSLYRQYTSLLGKMNSEEEDEVWQVIIGARAEMTSKHQEYLKLETTWMTAVGLSEMAAEAAYQTGADQASITARNHIQLVKLQVEEVHQLSRKAETKLAEAQIEELRQKTQEEGEERAESEQEAYLRED,55,238,184,AVPIAQKSEPHSLSSEALMRRAVSLVTDSTSTFLSQTTYALIEAITEYTKAVYTLTSLYRQYTSLLGKMNSEEEDEVWQVIIGARAEMTSKHQEYLKLETTWMTAVGLSEMAAEAAYQTGADQASITARNHIQLVKLQVEEVHQLSRKAETKLAEAQIEELRQKTQEEGEERAESEQEAYLRED,20752.38024469,20765.15828,,,,,1
1144,H2AZ_HUMAN,P0C0S5,Histone H2A.Z,P0C0S5,,MAGGKAGKDSGKAKTKAVSRSQRAGLQFPVGRIHRHLKSRTTSHGRVGATAAVYSAAILEYLTAEVLELAGNASKDLKVKRITPRHLQLAIRGDEELDSLIKATIAGGGVIPHIHKSLIGKKGQQKTV,1,127,127,AGGKAGKDSGKAKTKAVSRSQRAGLQFPVGRIHRHLKSRTTSHGRVGATAAVYSAAILEYLTAEVLELAGNASKDLKVKRITPRHLQLAIRGDEELDSLIKATIAGGGVIPHIHKSLIGKKGQQKTV,13413.51125469,13421.54678,,,,,1
1183,CRIP1_HUMAN,P50238,Cysteine-rich protein 1,P50238,,MPKCPKCNKEVYFAERVTSLGKDWHRPCLKCEKCGKTLTSGGHAEHEGKPYCNHPCYAAMFGPKGFGRGGAESHTFK,1,76,76,PKCPKCNKEVYFAERVTSLGKDWHRPCLKCEKCGKTLTSGGHAEHEGKPYCNHPCYAAMFGPKGFGRGGAESHTFK,8395.96666469,8401.63688,,,,,1
1212,PRPC_HUMAN,P02810,Salivary acidic proline-rich phosphoprotein 1/2,P02810,,MLLILLSVALLAFSSAQDLDEDVSQEDVPLVISDGGDSEQFIDEERQGPPLGGQQSQPSAGDGNQDDGPQQGPPQQGGQQQQGPPPPQGKPQGPPQQGGHPPPPQGRPQGPPQQGGHPRPPRGRPQGPPQQGGHQQGPPPPPPGKPQGPPPQGGRPQGPPQGQSPQ,122,165,44,GRPQGPPQQGGHQQGPPPPPPGKPQGPPPQGGRPQGPPQGQSPQ,4368.17604469,4370.77618,,,,,1
1220,DCD_HUMAN,P81605,Dermcidin,P81605-1,1,MRFMTLLFLTALAGALVCAYDPEAASAPGSGNPCHEASAAQKENAGEDPGLARQAPKPRKQRSSLLEKGLDGAKKAVGGLGKLGKDAVEDLESVGKGAVHDVKDVLDSVL,62,108,47,SSLLEKGLDGAKKAVGGLGKLGKDAVEDLESVGKGAVHDVKDVLDSV,4702.53913469,4705.34038,,,,,1
1265,SC61B_HUMAN,P60468,Protein transport protein Sec61 subunit beta,P60468,,MPGPTPSGTNVGSSGRSPSKAVAARAAGSTVRQRKNASCGTRSAGRTTSAGTGGMWRFYTEDSPGLKVGPVPVLVMSLLFIASVFMLHIWGKYTRS,1,95,95,PGPTPSGTNVGSSGRSPSKAVAARAAGSTVRQRKNASCGTRSAGRTTSAGTGGMWRFYTEDSPGLKVGPVPVLVMSLLFIASVFMLHIWGKYTRS,9837.05683469,9843.25988,,,,,3
1293,H2B1C_HUMAN,P62807,Histone H2B type 1-C/E/F/G/I,P62807,,MPEPAKSAPAPKKGSKKAVTKAQKKDGKKRKRSRKESYSVYVYKVLKQVHPDTGISSKAMGIMNSFVNDIFERIAGEASRLAHYNKRSTITSREIQTAVRLLLPGELAKHAVSEGTKAVTKYTSSK,1,125,125,PEPAKSAPAPKKGSKKAVTKAQKKDGKKRKRSRKESYSVYVYKVLKQVHPDTGISSKAMGIMNSFVNDIFERIAGEASRLAHYNKRSTITSREIQTAVRLLLPGELAKHAVSEGTKAVTKYTSSK,13766.51678469,13774.94648,,,,,1
1321,ATIF1_HUMAN,Q9UII2,ATPase inhibitor; mitochondrial,Q9UII2-1,1,MAVTALAARTWLGVWGVRTMQARGFGSDQSENVDRGAGSIREAGGAFGKREQAEEERYFRAQSREQLAALKKHHEEEIVHHKKEIERLQKEIERHKQKIKMLKHDD,25,105,81,GSDQSENVDRGAGSIREAGGAFGKREQAEEERYFRAQSREQLAALKKHHEEEIVHHKKEIERLQKEIERHKQKIKMLKHDD,9510.87158469,9516.55968,,,,,1
1327,H2A1C_HUMAN,Q93077,Histone H2A type 1-C,Q93077,,MSGRGKQGGKARAKAKSRSSRAGLQFPVGRVHRLLRKGNYAERVGAGAPVYLAAVLEYLTAEILELAGNAARDNKKTRIIPRHLQLAIRNDEELNKLLGRVTIAQGGVLPNIQAVLLPKKTESHHKAKGK,1,129,129,SGRGKQGGKARAKAKSRSSRAGLQFPVGRVHRLLRKGNYAERVGAGAPVYLAAVLEYLTAEILELAGNAARDNKKTRIIPRHLQLAIRNDEELNKLLGRVTIAQGGVLPNIQAVLLPKKTESHHKAKGK,13993.92988469,14002.32578,,RESID:67@2,,,1
1330,H2B1D_HUMAN,P58876,Histone H2B type 1-D,P58876,,MPEPTKSAPAPKKGSKKAVTKAQKKDGKKRKRSRKESYSVYVYKVLKQVHPDTGISSKAMGIMNSFVNDIFERIAGEASRLAHYNKRSTITSREIQTAVRLLLPGELAKHAVSEGTKAVTKYTSSK,1,125,125,PEPTKSAPAPKKGSKKAVTKAQKKDGKKRKRSRKESYSVYVYKVLKQVHPDTGISSKAMGIMNSFVNDIFERIAGEASRLAHYNKRSTITSREIQTAVRLLLPGELAKHAVSEGTKAVTKYTSSK,13796.52735469,13804.97278,,,,,1
1331,QCR6_HUMAN,P07919,Cytochrome b-c1 complex subunit 6; mitochondrial,P07919,,MGLEDEQKMLTESGDPEEEEEEEEELVDPLTTVREQCEQLEKCVKARERLELCDERVSSRSHTEEDCTEELFDFLHARDHCVAHKLFNNLK,13,90,78,GDPEEEEEEEEELVDPLTTVREQCEQLEKCVKARERLELCDERVSSRSHTEEDCTEELFDFLHARDHCVAHKLFNNLK,9240.28146469,9246.09428,,,,,1
1332,SODM_HUMAN,P04179,Superoxide dismutase [Mn]; mitochondrial,P04179-1,1,MLSRAVCGTSRQLAPALGYLGSRQKHSLPDLPYDYGALEPHINAQIMQLHHSKHHAAYVNNLNVTEEKYQEALAKGDVTAQIALQPALKFNGGGHINHSIFWTNLSPNGGGEPKGELLEAIKRDFGSFDKFKEKLTAASVGVQGSGWGWLGFNKERGHLQIAACPNQDPLQGTTGLIPLLGIDVWEHAYYLQYKNVRPDYLKAIWNVINWENVTERYMACKK,24,221,198,KHSLPDLPYDYGALEPHINAQIMQLHHSKHHAAYVNNLNVTEEKYQEALAKGDVTAQIALQPALKFNGGGHINHSIFWTNLSPNGGGEPKGELLEAIKRDFGSFDKFKEKLTAASVGVQGSGWGWLGFNKERGHLQIAACPNQDPLQGTTGLIPLLGIDVWEHAYYLQYKNVRPDYLKAIWNVINWENVTERYMACKK,22190.24330469,22204.13898,,,,,1
1335,H2B2E_HUMAN,Q16778,Histone H2B type 2-E,Q16778,,MPEPAKSAPAPKKGSKKAVTKAQKKDGKKRKRSRKESYSIYVYKVLKQVHPDTGISSKAMGIMNSFVNDIFERIAGEASRLAHYNKRSTITSREIQTAVRLLLPGELAKHAVSEGTKAVTKYTSSK,1,125,125,PEPAKSAPAPKKGSKKAVTKAQKKDGKKRKRSRKESYSIYVYKVLKQVHPDTGISSKAMGIMNSFVNDIFERIAGEASRLAHYNKRSTITSREIQTAVRLLLPGELAKHAVSEGTKAVTKYTSSK,13780.53243469,13788.97328,,,,,1
1364,PPIB_HUMAN,P23284,Peptidyl-prolyl cis-trans isomerase B,P23284,,MLRLSERNMKVLLAAALIAGSVFFLLLPGPSAADEKKKGPKVTVKVYFDLRIGDEDVGRVIFGLFGKTVPKTVDNFVALATGEKGFGYKNSKFHRVIKDFMIQGGDFTRGDGTGGKSIYGERFPDENFKLKHYGPGWVSMANAGKDTNGSQFFITTVKTAWLDGKHVVFGKVLEGMEVVRKVESTKTDSRDKPLKDVIIADCGKIEVEKPFAIAKE,33,215,183,DEKKKGPKVTVKVYFDLRIGDEDVGRVIFGLFGKTVPKTVDNFVALATGEKGFGYKNSKFHRVIKDFMIQGGDFTRGDGTGGKSIYGERFPDENFKLKHYGPGWVSMANAGKDTNGSQFFITTVKTAWLDGKHVVFGKVLEGMEVVRKVESTKTDSRDKPLKDVIIADCGKIEVEKPFAIAKE,20276.57397469,20289.28678,,,,,1
1375,PEBP1_HUMAN,P30086,Phosphatidylethanolamine-binding protein 1,P30086,,MPVDLSKWSGPLSLQEVDEQPQHPLHVTYAGAAVDELGKVLTPTQVKNRPTSISWDGLDSGKLYTLVLTDPDAPSRKDPKYREWHHFLVVNMKGNDISSGTVLSDYVGSGPPKGTGLHRYVWLVYEQDRPLKCDEPILSNRSGDHRGKFKVASFRKKYELRAPVAGTCYQAEWDDYVPKLYEQLSGK,1,186,186,PVDLSKWSGPLSLQEVDEQPQHPLHVTYAGAAVDELGKVLTPTQVKNRPTSISWDGLDSGKLYTLVLTDPDAPSRKDPKYREWHHFLVVNMKGNDISSGTVLSDYVGSGPPKGTGLHRYVWLVYEQDRPLKCDEPILSNRSGDHRGKFKVASFRKKYELRAPVAGTCYQAEWDDYVPKLYEQLSGK,20912.62518469,20925.59218,,,,,1
1391,RS14_HUMAN,P62263,40S ribosomal protein S14,P62263,,MAPRKGKEKKEEQVISLGPQVAEGENVFGVCHIFASFNDTFVHVTDLSGKETICRVTGGMKVKADRDESSPYAAMLAAQDVAQRCKELGITALHIKLRATGGNRTKTPGPGAQSALRALARSGMKIGRIEDVTPIPSDSTRRKGGRRGRRL,1,150,150,APRKGKEKKEEQVISLGPQVAEGENVFGVCHIFASFNDTFVHVTDLSGKETICRVTGGMKVKADRDESSPYAAMLAAQDVAQRCKELGITALHIKLRATGGNRTKTPGPGAQSALRALARSGMKIGRIEDVTPIPSDSTRRKGGRRGRRL,16131.49203469,16141.51328,,,,,1
1449,H2B1O_HUMAN,P23527,Histone H2B type 1-O,P23527,,MPDPAKSAPAPKKGSKKAVTKAQKKDGKKRKRSRKESYSIYVYKVLKQVHPDTGISSKAMGIMNSFVNDIFERIAGEASRLAHYNKRSTITSREIQTAVRLLLPGELAKHAVSEGTKAVTKYTSSK,1,125,125,PDPAKSAPAPKKGSKKAVTKAQKKDGKKRKRSRKESYSIYVYKVLKQVHPDTGISSKAMGIMNSFVNDIFERIAGEASRLAHYNKRSTITSREIQTAVRLLLPGELAKHAVSEGTKAVTKYTSSK,13766.51678469,13774.94638,,,,,1
1470,QCR9_HUMAN,Q9UDW1,Cytochrome b-c1 complex subunit 9,Q9UDW1-1,1,MAAATLTSKLYSLLFRRTSTFALTIIVGVMFFERAFDQGADAIYDHINEGKLWKHIKHKYENK,1,62,62,AAATLTSKLYSLLFRRTSTFALTIIVGVMFFERAFDQGADAIYDHINEGKLWKHIKHKYENK,7172.78537469,7177.29908,,,,,1
1489,COX41_HUMAN,P13073,Cytochrome c oxidase subunit 4 isoform 1; mitochondrial,P13073,,MLATRVFSLVGKRAISTSVCVRAHESVVKSEDFSLPAYMDRRDHPLPEVAHVKHLSASQKALKEKEKASWSSLSMDEKVELYRIKFKESFAEMNRGSNEWKTVVGGAMFFIGFTALVIMWQKHYVYGPLPQSFDKEWVAKQTKRMLDMKVNPIQGLASKWDYEKNEWKK,22,168,147,AHESVVKSEDFSLPAYMDRRDHPLPEVAHVKHLSASQKALKEKEKASWSSLSMDEKVELYRIKFKESFAEMNRGSNEWKTVVGGAMFFIGFTALVIMWQKHYVYGPLPQSFDKEWVAKQTKRMLDMKVNPIQGLASKWDYEKNEWKK,17188.71889469,17199.80068,,,,,1
1521,H2B2F_HUMAN,Q5QNW6,Histone H2B type 2-F,Q5QNW6-1,1,MPDPAKSAPAPKKGSKKAVTKVQKKDGKKRKRSRKESYSVYVYKVLKQVHPDTGISSKAMGIMNSFVNDIFERIAGEASRLAHYNKRSTITSREIQTAVRLLLPGELAKHAVSEGTKAVTKYTSSK,0,125,126,MPDPAKSAPAPKKGSKKAVTKVQKKDGKKRKRSRKESYSVYVYKVLKQVHPDTGISSKAMGIMNSFVNDIFERIAGEASRLAHYNKRSTITSREIQTAVRLLLPGELAKHAVSEGTKAVTKYTSSK,13911.57292469,13920.16598,,,,,1
1525,H33_HUMAN,P84243,Histone H3.3,P84243,,MARTKQTARKSTGGKAPRKQLATKAARKSAPSTGGVKKPHRYRPGTVALREIRRYQKSTELLIRKLPFQRLVREIAQDFKTDLRFQSAAIGALQEASEAYLVGLFEDTNLCAIHAKRVTIMPKDIQLARRIRGERA,0,135,136,MARTKQTARKSTGGKAPRKQLATKAARKSAPSTGGVKKPHRYRPGTVALREIRRYQKSTELLIRKLPFQRLVREIAQDFKTDLRFQSAAIGALQEASEAYLVGLFEDTNLCAIHAKRVTIMPKDIQLARRIRGERA,15318.50255469,15327.91148,,,,,1
1544,RL27_HUMAN,P61353,60S ribosomal protein L27,P61353,,MGKFMKPGKVVLVLAGRYSGRKAVIVKNIDDGTSDRPYSHALVAGIDRYPRKVTAAMGKKKIAKRSKIKSFVKVYNYNHLMPTRYSVDIPLDKTVVNKDVFRDPALKRKARREAKVKFEERYKTGKNKWFFQKLRF,1,135,135,GKFMKPGKVVLVLAGRYSGRKAVIVKNIDDGTSDRPYSHALVAGIDRYPRKVTAAMGKKKIAKRSKIKSFVKVYNYNHLMPTRYSVDIPLDKTVVNKDVFRDPALKRKARREAKVKFEERYKTGKNKWFFQKLRF,15656.70681469,15666.53018,,,,,1
1549,H2B2F_HUMAN,Q5QNW6,Histone H2B type 2-F,Q5QNW6-1,1,MPDPAKSAPAPKKGSKKAVTKVQKKDGKKRKRSRKESYSVYVYKVLKQVHPDTGISSKAMGIMNSFVNDIFERIAGEASRLAHYNKRSTITSREIQTAVRLLLPGELAKHAVSEGTKAVTKYTSSK,1,125,125,PDPAKSAPAPKKGSKKAVTKVQKKDGKKRKRSRKESYSVYVYKVLKQVHPDTGISSKAMGIMNSFVNDIFERIAGEASRLAHYNKRSTITSREIQTAVRLLLPGELAKHAVSEGTKAVTKYTSSK,13780.53243469,13788.97338,,,,,1
1605,SSBP_HUMAN,Q04837,Single-stranded DNA-binding protein; mitochondrial,Q04837,,MFRRPVLQVLRQFVRHESETTTSLVLERSLNRVHLLGRVGQDPVLRQVEGKNPVTIFSLATNEMWRSGDSEVYQLGDVSQKTTWHRISVFRPGLRDVAYQYVKKGSRIYLEGKIDYGEYMDKNNVRRQATTIIADNIIFLSDQTKEKE,16,147,132,ESETTTSLVLERSLNRVHLLGRVGQDPVLRQVEGKNPVTIFSLATNEMWRSGDSEVYQLGDVSQKTTWHRISVFRPGLRDVAYQYVKKGSRIYLEGKIDYGEYMDKNNVRRQATTIIADNIIFLSDQTKEKE,15185.84916469,15195.13688,,,,,1
1610,H2A1B_HUMAN,P04908,Histone H2A type 1-B/E,P04908,,MSGRGKQGGKARAKAKTRSSRAGLQFPVGRVHRLLRKGNYSERVGAGAPVYLAAVLEYLTAEILELAGNAARDNKKTRIIPRHLQLAIRNDEELNKLLGRVTIAQGGVLPNIQAVLLPKKTESHHKAKGK,1,129,129,SGRGKQGGKARAKAKTRSSRAGLQFPVGRVHRLLRKGNYSERVGAGAPVYLAAVLEYLTAEILELAGNAARDNKKTRIIPRHLQLAIRNDEELNKLLGRVTIAQGGVLPNIQAVLLPKKTESHHKAKGK,13995.90915469,14004.30208,,,,,1
1654,RL39_HUMAN,P62891,60S ribosomal protein L39,P62891,,MSSHKTFRIKRFLAKKQKQNRPIPQWIRMKTGNKIRYNSKRRHWRRTKLGL,1,50,50,SSHKTFRIKRFLAKKQKQNRPIPQWIRMKTGNKIRYNSKRRHWRRTKLGL,6271.60990469,6275.48528,,,,,1
1664,H2B1N_HUMAN,Q99877,Histone H2B type 1-N,Q99877,,MPEPSKSAPAPKKGSKKAVTKAQKKDGKKRKRSRKESYSVYVYKVLKQVHPDTGISSKAMGIMNSFVNDIFERIAGEASRLAHYNKRSTITSREIQTAVRLLLPGELAKHAVSEGTKAVTKYTSSK,1,125,125,PEPSKSAPAPKKGSKKAVTKAQKKDGKKRKRSRKESYSVYVYKVLKQVHPDTGISSKAMGIMNSFVNDIFERIAGEASRLAHYNKRSTITSREIQTAVRLLLPGELAKHAVSEGTKAVTKYTSSK,13862.47803569,13870.92588,,RESID:37@13,,,1
1684,ARF1_HUMAN,P84077,ADP-ribosylation factor 1,P84077,,MGNIFANLFKGLFGKKEMRILMVGLDAAGKTTILYKLKLGEIVTTIPTIGFNVETVEYKNISFTVWDVGGQDKIRPLWRHYFQNTQGLIFVVDSNDRERVNEAREELMRMLAEDELRDAVLLVFANKQDLPNAMNAAEITDKLGLHSLRHRNWYIQATCATSGDGLYEGLDWLSNQLRNQK,1,180,180,GNIFANLFKGLFGKKEMRILMVGLDAAGKTTILYKLKLGEIVTTIPTIGFNVETVEYKNISFTVWDVGGQDKIRPLWRHYFQNTQGLIFVVDSNDRERVNEAREELMRMLAEDELRDAVLLVFANKQDLPNAMNAAEITDKLGLHSLRHRNWYIQATCATSGDGLYEGLDWLSNQLRNQK,20762.82596969,20775.93668,,RESID:59@0,,,1
1724,COX8A_HUMAN,P10176,Cytochrome c oxidase subunit 8A; mitochondrial,P10176,,MSVLTPLLLRGLTGSARRLPVPRAKIHSLPPEGKLGIMELAVGLTSCFVTFLLPAGWILSHLETYRRPE,25,68,44,IHSLPPEGKLGIMELAVGLTSCFVTFLLPAGWILSHLETYRRPE,4890.59677469,4893.78288,,,,,1
1764,H2B1H_HUMAN,Q93079,Histone H2B type 1-H,Q93079,,MPDPAKSAPAPKKGSKKAVTKAQKKDGKKRKRSRKESYSVYVYKVLKQVHPDTGISSKAMGIMNSFVNDIFERIAGEASRLAHYNKRSTITSREIQTAVRLLLPGELAKHAVSEGTKAVTKYTSSK,1,125,125,PDPAKSAPAPKKGSKKAVTKAQKKDGKKRKRSRKESYSVYVYKVLKQVHPDTGISSKAMGIMNSFVNDIFERIAGEASRLAHYNKRSTITSREIQTAVRLLLPGELAKHAVSEGTKAVTKYTSSK,13752.50113469,13760.91958,,,,,1
1836,H2B2E_HUMAN,Q16778,Histone H2B type 2-E,Q16778,,MPEPAKSAPAPKKGSKKAVTKAQKKDGKKRKRSRKESYSIYVYKVLKQVHPDTGISSKAMGIMNSFVNDIFERIAGEASRLAHYNKRSTITSREIQTAVRLLLPGELAKHAVSEGTKAVTKYTSSK,0,125,126,MPEPAKSAPAPKKGSKKAVTKAQKKDGKKRKRSRKESYSIYVYKVLKQVHPDTGISSKAMGIMNSFVNDIFERIAGEASRLAHYNKRSTITSREIQTAVRLLLPGELAKHAVSEGTKAVTKYTSSK,13911.57292469,13920.16588,,,,,1
1859,H32_HUMAN,Q71DI3,Histone H3.2,Q71DI3,,MARTKQTARKSTGGKAPRKQLATKAARKSAPATGGVKKPHRYRPGTVALREIRRYQKSTELLIRKLPFQRLVREIAQDFKTDLRFQSSAVMALQEASEAYLVGLFEDTNLCAIHAKRVTIMPKDIQLARRIRGERA,0,135,136,MARTKQTARKSTGGKAPRKQLATKAARKSAPATGGVKKPHRYRPGTVALREIRRYQKSTELLIRKLPFQRLVREIAQDFKTDLRFQSSAVMALQEASEAYLVGLFEDTNLCAIHAKRVTIMPKDIQLARRIRGERA,15378.50593469,15388.02538,,,,,1
1862,MIF_HUMAN,P14174,Macrophage migration inhibitory factor,P14174,,MPMFIVNTNVPRASVPDGFLSELTQQLAQATGKPPQYIAVHVVPDQLMAFGGSSEPCALCSLHSIGKIGGAQNRSYSKLLCGLLAERLRISPDRVYINYYDMNAANVGWNNSTFA,1,114,114,PMFIVNTNVPRASVPDGFLSELTQQLAQATGKPPQYIAVHVVPDQLMAFGGSSEPCALCSLHSIGKIGGAQNRSYSKLLCGLLAERLRISPDRVYINYYDMNAANVGWNNSTFA,12337.17865469,12345.10708,,,,,1
1865,RL22_HUMAN,P35268,60S ribosomal protein L22,P35268,,MAPVKKLVVKGGKKKKQVLKFTLDCTHPVEDGIMDAANFEQFLQERIKVNGKAGNLGGGVVTIERSKSKITVTSEVPFSKRYLKYLTKKYLKKNNLRDWLRVVANSKESYELRYFQINQDEEEEEDED,1,127,127,APVKKLVVKGGKKKKQVLKFTLDCTHPVEDGIMDAANFEQFLQERIKVNGKAGNLGGGVVTIERSKSKITVTSEVPFSKRYLKYLTKKYLKKNNLRDWLRVVANSKESYELRYFQINQDEEEEEDED,14646.76337469,14655.79938,,,,,1
1887,H2B1N_HUMAN,Q99877,Histone H2B type 1-N,Q99877,,MPEPSKSAPAPKKGSKKAVTKAQKKDGKKRKRSRKESYSVYVYKVLKQVHPDTGISSKAMGIMNSFVNDIFERIAGEASRLAHYNKRSTITSREIQTAVRLLLPGELAKHAVSEGTKAVTKYTSSK,1,125,125,PEPSKSAPAPKKGSKKAVTKAQKKDGKKRKRSRKESYSVYVYKVLKQVHPDTGISSKAMGIMNSFVNDIFERIAGEASRLAHYNKRSTITSREIQTAVRLLLPGELAKHAVSEGTKAVTKYTSSK,13782.51170469,13790.94588,,,,,1
1905,H2B1H_HUMAN,Q93079,Histone H2B type 1-H,Q93079,,MPDPAKSAPAPKKGSKKAVTKAQKKDGKKRKRSRKESYSVYVYKVLKQVHPDTGISSKAMGIMNSFVNDIFERIAGEASRLAHYNKRSTITSREIQTAVRLLLPGELAKHAVSEGTKAVTKYTSSK,0,125,126,MPDPAKSAPAPKKGSKKAVTKAQKKDGKKRKRSRKESYSVYVYKVLKQVHPDTGISSKAMGIMNSFVNDIFERIAGEASRLAHYNKRSTITSREIQTAVRLLLPGELAKHAVSEGTKAVTKYTSSK,13883.54162469,13892.11218,,,,,1
1942,RS17_HUMAN,P08708,40S ribosomal protein S17,P08708,,MGRVRTKTVKKAARVIIEKYYTRLGNDFHTNKRVCEEIAIIPSKKLRNKIAGYVTHLMKRIQRGPVRGISIKLQEEERERRDNYVPEVSALDQEIIEVDPDTKEMLKLLDFGSLSNLQVTQPTVGMNFKTPRGPV,1,134,134,GRVRTKTVKKAARVIIEKYYTRLGNDFHTNKRVCEEIAIIPSKKLRNKIAGYVTHLMKRIQRGPVRGISIKLQEEERERRDNYVPEVSALDQEIIEVDPDTKEMLKLLDFGSLSNLQVTQPTVGMNFKTPRGPV,15409.34911469,15418.92868,,,,,1
1945,ZN706_HUMAN,Q9Y5V0,Zinc finger protein 706,Q9Y5V0,,MARGQQKIQSQQKNAKKQAGQKKKQGHDQKAAAKAALIYTCTVCRTQMPDPKTFKQHFESKHPKTPLPPELADVQA,1,75,75,ARGQQKIQSQQKNAKKQAGQKKKQGHDQKAAAKAALIYTCTVCRTQMPDPKTFKQHFESKHPKTPLPPELADVQA,8361.40652469,8366.63328,,,,,1
1952,H2B1D_HUMAN,P58876,Histone H2B type 1-D,P58876,,MPEPTKSAPAPKKGSKKAVTKAQKKDGKKRKRSRKESYSVYVYKVLKQVHPDTGISSKAMGIMNSFVNDIFERIAGEASRLAHYNKRSTITSREIQTAVRLLLPGELAKHAVSEGTKAVTKYTSSK,0,125,126,MPEPTKSAPAPKKGSKKAVTKAQKKDGKKRKRSRKESYSVYVYKVLKQVHPDTGISSKAMGIMNSFVNDIFERIAGEASRLAHYNKRSTITSREIQTAVRLLLPGELAKHAVSEGTKAVTKYTSSK,13927.56784469,13936.16538,,,,,1
1976,NDUA4_HUMAN,O00483,Cytochrome c oxidase subunit NDUFA4,O00483,,MLRQIIGQAKKHPSLIPLFVFIGTGATGATLYLLRLALFNPDVCWDRNNPEPWNKLGPNDQYKFYSVNVDYSKLKKERPDF,0,80,81,MLRQIIGQAKKHPSLIPLFVFIGTGATGATLYLLRLALFNPDVCWDRNNPEPWNKLGPNDQYKFYSVNVDYSKLKKERPDF,9363.91017468999,9369.86228,,,,,1
2003,NDUBB_HUMAN,Q9NX14,NADH dehydrogenase [ubiquinone] 1 beta subcomplex subunit 11; mitochondrial,Q9NX14-1,1,MAAGLFGLSARRLLAAAATRGLPAARVRWESSFSRTVVAPSAVAGKRPPEPTTPWQEDPEPEDENLYEKNPDSHGYDKDPVLDVWNMRLVFFFGVSIILVLGSTFVAYLPDYRMKEWSRREAERLVKYREANGLPIMESNCFDPSKIQLPEDE,29,152,124,ESSFSRTVVAPSAVAGKRPPEPTTPWQEDPEPEDENLYEKNPDSHGYDKDPVLDVWNMRLVFFFGVSIILVLGSTFVAYLPDYRMKEWSRREAERLVKYREANGLPIMESNCFDPSKIQLPEDE,14301.01808469,14310.04158,,,,,1
2020,ARF4_HUMAN,P18085,ADP-ribosylation factor 4,P18085,,MGLTISSLFSRLFGKKQMRILMVGLDAAGKTTILYKLKLGEIVTTIPTIGFNVETVEYKNICFTVWDVGGQDRIRPLWKHYFQNTQGLIFVVDSNDRERIQEVADELQKMLLVDELRDAVLLLFANKQDLPNAMAISEMTDKLGLQSLRNRTWYVQATCATQGTGLYEGLDWLSNELSKR,1,179,179,GLTISSLFSRLFGKKQMRILMVGLDAAGKTTILYKLKLGEIVTTIPTIGFNVETVEYKNICFTVWDVGGQDRIRPLWKHYFQNTQGLIFVVDSNDRERIQEVADELQKMLLVDELRDAVLLLFANKQDLPNAMAISEMTDKLGLQSLRNRTWYVQATCATQGTGLYEGLDWLSNELSKR,20576.85065969,20589.94368,,RESID:59@0,,,1
2119,RS19_HUMAN,P39019,40S ribosomal protein S19,P39019,,MPGVTVKDVNQQEFVRALAAFLKKSGKLKVPEWVDTVKLAKHKELAPYDENWFYTRAASTARHLYLRGGAGVGSMTKIYGGRQRNGVMPSHFSRGSKSVARRVLQALEGLKMVEKDQDGGRKLTPQGQRDLDRIAGQVAAANKKH,1,144,144,PGVTVKDVNQQEFVRALAAFLKKSGKLKVPEWVDTVKLAKHKELAPYDENWFYTRAASTARHLYLRGGAGVGSMTKIYGGRQRNGVMPSHFSRGSKSVARRVLQALEGLKMVEKDQDGGRKLTPQGQRDLDRIAGQVAAANKKH,15919.49426469,15929.30718,,,,,1
2121,RS28_HUMAN,P62857,40S ribosomal protein S28,P62857,,MDTSRVQPIKLARVTKVLGRTGSQGQCTQVRVEFMDDTSRSIIRNVKGPVREGDVLTLLESEREARRLR,1,68,68,DTSRVQPIKLARVTKVLGRTGSQGQCTQVRVEFMDDTSRSIIRNVKGPVREGDVLTLLESEREARRLR,7705.16079469,7709.83408,,,,,1
2180,ATP5I_HUMAN,P56385,ATP synthase subunit e; mitochondrial,P56385,,MVPPVQVSPLIKLGRYSALFLGVAYGATRYNYLKPRAEEERRIAAEEKKKQDELKRIARELAEDDSILK,1,68,68,VPPVQVSPLIKLGRYSALFLGVAYGATRYNYLKPRAEEERRIAAEEKKKQDELKRIARELAEDDSILK,7797.28484469,7802.01788,,,,,1
2211,RL32_HUMAN,P62910,60S ribosomal protein L32,P62910,,MAALRPLVKPKIVKKRTKKFIRHQSDRYVKIKRNWRKPRGIDNRVRRRFKGQILMPNIGYGSNKKTKHMLPSGFRKFLVHNVKELEVLLMCNKSYCAEIAHNVSSKNRKAIVERAAQLAIRVTNPNARLRSEENE,1,134,134,AALRPLVKPKIVKKRTKKFIRHQSDRYVKIKRNWRKPRGIDNRVRRRFKGQILMPNIGYGSNKKTKHMLPSGFRKFLVHNVKELEVLLMCNKSYCAEIAHNVSSKNRKAIVERAAQLAIRVTNPNARLRSEENE,15718.76346469,15728.60978,,,,,1
2222,MIF_HUMAN,P14174,Macrophage migration inhibitory factor,P14174,,MPMFIVNTNVPRASVPDGFLSELTQQLAQATGKPPQYIAVHVVPDQLMAFGGSSEPCALCSLHSIGKIGGAQNRSYSKLLCGLLAERLRISPDRVYINYYDMNAANVGWNNSTFA,1,114,114,PMFIVNTNVPRASVPDGFLSELTQQLAQATGKPPQYIAVHVVPDQLMAFGGSSEPCALCSLHSIGKIGGAQNRSYSKLLCGLLAERLRISPDRVYINYYDMNAANVGWNNSTFA,12379.18921969,12387.14708,,RESID:55@76,,,1
2224,S10A4_HUMAN,P26447,Protein S100-A4,P26447,,MACPLEKALDVMVSTFHKYSGKEGDKFKLNKSELKELLTRELPSFLGKRTDEAAFQKLMSNLDSNRDNEVDFQEYCVFLSCIAMMCNEFFEGFPDKQPRKK,1,100,100,ACPLEKALDVMVSTFHKYSGKEGDKFKLNKSELKELLTRELPSFLGKRTDEAAFQKLMSNLDSNRDNEVDFQEYCVFLSCIAMMCNEFFEGFPDKQPRKK,11631.70197969,11639.36318,,RESID:55@5,,,1
2233,H2B1O_HUMAN,P23527,Histone H2B type 1-O,P23527,,MPDPAKSAPAPKKGSKKAVTKAQKKDGKKRKRSRKESYSIYVYKVLKQVHPDTGISSKAMGIMNSFVNDIFERIAGEASRLAHYNKRSTITSREIQTAVRLLLPGELAKHAVSEGTKAVTKYTSSK,0,125,126,MPDPAKSAPAPKKGSKKAVTKAQKKDGKKRKRSRKESYSIYVYKVLKQVHPDTGISSKAMGIMNSFVNDIFERIAGEASRLAHYNKRSTITSREIQTAVRLLLPGELAKHAVSEGTKAVTKYTSSK,13897.55727469,13906.13898,,,,,1