PFR,UniProt Id,Entry Accession,Entry Description,Isoform Accession,Isoform Description,Isoform Sequence,Start,End,Length,Proteoform Sequence,Monoisotopic Mass,Average Mass,Sequence Modifications,PTMs,N-Terminal,C-Terminal,Star
1397,RS30_HUMAN,P62861,40S ribosomal protein S30,P62861,,KVHGSLARAGKVRGQTPKVAKQEKKKKKTGRAKRRMQYNRRFVNVVPTFGKKKGPNANS,0,58,59,KVHGSLARAGKVRGQTPKVAKQEKKKKKTGRAKRRMQYNRRFVNVVPTFGKKKGPNANS,6643.81662469,6647.85898,,,,,3
3402,RS21_HUMAN,P63220,40S ribosomal protein S21,P63220,,MQNDAGEFVDLYVPRKCSASNRIIGAKDHASIQMNVAEVDKVTGRFNGQFKTYAICGAIRRMGESDDSILRLAKADGIVSKNF,0,82,83,MQNDAGEFVDLYVPRKCSASNRIIGAKDHASIQMNVAEVDKVTGRFNGQFKTYAICGAIRRMGESDDSILRLAKADGIVSKNF,9105.56835469,9111.37578000001,,,,,1
3731,RL26_HUMAN,P61254,60S ribosomal protein L26,P61254,,MKFNPFVTSDRSKNRKRHFNAPSHIRRKIMSSPLSKELRQKYNVRSMPIRKDDEVQVVRGHYKGQQIGKVVQVYRKKYVIYIERVQREKANGTTVHVGIHPSKVVITRLKLDKDRKKILERKAKSRQVGKEKGKYKEETIEKMQE,0,144,145,MKFNPFVTSDRSKNRKRHFNAPSHIRRKIMSSPLSKELRQKYNVRSMPIRKDDEVQVVRGHYKGQQIGKVVQVYRKKYVIYIERVQREKANGTTVHVGIHPSKVVITRLKLDKDRKKILERKAKSRQVGKEKGKYKEETIEKMQE,17247.53204469,17258.21048,,,,,1
5904,NOP10_HUMAN,Q9NPE3,H/ACA ribonucleoprotein complex subunit 3,Q9NPE3,,MFLQYYLNEQGDRVYTLKKFDPMGQQTCSAHPARFSPDDKYSRHRITIKKRFKVLMTQQPRPVL,0,63,64,MFLQYYLNEQGDRVYTLKKFDPMGQQTCSAHPARFSPDDKYSRHRITIKKRFKVLMTQQPRPVL,7700.96858469,7705.96548,,,,,1
6679,RL19_HUMAN,P84098,60S ribosomal protein L19,P84098,,MSMLRLQKRLASSVLRCGKKKVWLDPNETNEIANANSRQQIRKLIKDGLIIRKPVTVHSRARCRKNTLARRKGRHMGIGKRKGTANARMPEKVTWMRRMRILRRLLRRYRESKKIDRHMYHSLYLKVKGNVFKNKRILMEHIHKLKADKARKKLLADQAEARRSKTKEARKRREERLQAKKEEIIKTLSKEEETKK,0,195,196,MSMLRLQKRLASSVLRCGKKKVWLDPNETNEIANANSRQQIRKLIKDGLIIRKPVTVHSRARCRKNTLARRKGRHMGIGKRKGTANARMPEKVTWMRRMRILRRLLRRYRESKKIDRHMYHSLYLKVKGNVFKNKRILMEHIHKLKADKARKKLLADQAEARRSKTKEARKRREERLQAKKEEIIKTLSKEEETKK,23451.24625469,23465.96968,,,,,1
9915,RL37A_HUMAN,P61513,60S ribosomal protein L37a,P61513,,MAKRTKKVGIVGKYGTRYGASLRKMVKKIEISQHAKYTCSFCGKTKMKRRAVGIWHCGSCMKTVAGGAWTYNTTSAVTVKSAIRRLKELKDQ,0,91,92,MAKRTKKVGIVGKYGTRYGASLRKMVKKIEISQHAKYTCSFCGKTKMKRRAVGIWHCGSCMKTVAGGAWTYNTTSAVTVKSAIRRLKELKDQ,10268.47450469,10275.25488,,,,,1
11801,H15_HUMAN,P16401,Histone H1.5,P16401,,MSETAPAETATPAPVEKSPAKKKATKKAAGAGAAKRKATGPPVSELITKAVAASKERNGLSLAALKKALAAGGYDVEKNNSRIKLGLKSLVSKGTLVQTKGTGASGSFKLNKKAASGEAKPKAKKAGAAKAKKPAGATPKKAKKAAGAKKAVKKTPKKAKKPAAAGVKKVAKSPKKAKAAAKPKKATKSPAKPKAVKPKAAKPKAAKPKAAKPKAAKAKKAAAKKK,0,225,226,MSETAPAETATPAPVEKSPAKKKATKKAAGAGAAKRKATGPPVSELITKAVAASKERNGLSLAALKKALAAGGYDVEKNNSRIKLGLKSLVSKGTLVQTKGTGASGSFKLNKKAASGEAKPKAKKAGAAKAKKPAGATPKKAKKAAGAKKAVKKTPKKAKKPAAAGVKKVAKSPKKAKAAAKPKKATKSPAKPKAVKPKAAKPKAAKPKAAKPKAAKAKKAAAKKK,22566.46766469,22580.17478,,,,,0
11866,RL13_HUMAN,P26373,60S ribosomal protein L13,P26373-1,1,MAPSRNGMVLKPHFHKDWQRRVATWFNQPARKIRRRKARQAKARRIAPRPASGPIRPIVRCPTVRYHTKVRAGRGFSLEELRVAGIHKKVARTIGISVDPRRRNKSTESLQANVQRLKEYRSKLILFPRKPSAPKKGDSSAEELKLATQLTGPVMPVRNVYKKEKARVITEEEKNFKAFASLRMARANARLFGIRAKRAKEAAEQDVEKKK,0,210,211,MAPSRNGMVLKPHFHKDWQRRVATWFNQPARKIRRRKARQAKARRIAPRPASGPIRPIVRCPTVRYHTKVRAGRGFSLEELRVAGIHKKVARTIGISVDPRRRNKSTESLQANVQRLKEYRSKLILFPRKPSAPKKGDSSAEELKLATQLTGPVMPVRNVYKKEKARVITEEEKNFKAFASLRMARANARLFGIRAKRAKEAAEQDVEKKK,24246.52560469,24261.47698,,,,,1
11867,RS27_HUMAN,P42677,40S ribosomal protein S27,P42677,,MPLAKDLLHPSPEEEKRKHKKKRLVQSPNSYFMDVKCPGCYKITTVFSHAQTVVLCVGCSTVLCQPTGGKARLTEGCSFRRKQH,0,83,84,MPLAKDLLHPSPEEEKRKHKKKRLVQSPNSYFMDVKCPGCYKITTVFSHAQTVVLCVGCSTVLCQPTGGKARLTEGCSFRRKQH,9496.84621969,9503.16308,,PSI-MOD:394@35,,,0
11868,RL27A_HUMAN,P46776,60S ribosomal protein L27a,P46776,,MPSRLRKTRKLRGHVSHGHGRIGKHRKHPGGRGNAGGLHHHRINFDKYHPGYFGKVGMKHYHLKRNQSFCPTVNLDKLWTLVSEQTRVNAAKNKTGAAPIIDVVRSGYYKVLGKGKLPKQPVIVKAKFFSRRAEEKIKSVGGACVLVA,1,147,147,PSRLRKTRKLRGHVSHGHGRIGKHRKHPGGRGNAGGLHHHRINFDKYHPGYFGKVGMKHYHLKRNQSFCPTVNLDKLWTLVSEQTRVNAAKNKTGAAPIIDVVRSGYYKVLGKGKLPKQPVIVKAKFFSRRAEEKIKSVGGACVLVA,16435.99743969,16446.19378,,PSI-MOD:425@37,,,0
11869,RL28_HUMAN,P46779,60S ribosomal protein L28,P46779-1,1,MSAHLQWMVVRNCSSFLIKRNKQTYSTEPNNLKARNSFRYNGLIHRKTVGVEPAADGKGVVVVIKRRSGQRKPATSYVRTTINKNARATLSSIRHMIRKNKYRPDLRMAAIRRASAILRSQKPVMVKRKRTRPTKSS,0,136,137,MSAHLQWMVVRNCSSFLIKRNKQTYSTEPNNLKARNSFRYNGLIHRKTVGVEPAADGKGVVVVIKRRSGQRKPATSYVRTTINKNARATLSSIRHMIRKNKYRPDLRMAAIRRASAILRSQKPVMVKRKRTRPTKSS,15737.67076469,15747.50198,,,,,0
11870,RL29_HUMAN,P47914,60S ribosomal protein L29,P47914,,MAKSKNHTTHNQSRKWHRNGIKKPRSQRYESLKGVDPKFLRNMRFAKKHNKKGLKKMQANNAKAMSARAEAIKALVKPKEVKPKIPKGVSRKLDRLAYIAHPKLGKRARARIAKGLRLCRPKAKAKAKAKDQTKAQAAAPASVPAQAPKRTQAPTKASE,1,158,158,AKSKNHTTHNQSRKWHRNGIKKPRSQRYESLKGVDPKFLRNMRFAKKHNKKGLKKMQANNAKAMSARAEAIKALVKPKEVKPKIPKGVSRKLDRLAYIAHPKLGKRARARIAKGLRLCRPKAKAKAKAKDQTKAQAAAPASVPAQAPKRTQAPTKASE,17666.04651969,17676.94718,,PSI-MOD:394@0|PSI-MOD:85@3,,,0
11871,RS25_HUMAN,P62851,40S ribosomal protein S25,P62851,,MPPKDDKKKKDAGKSAKKDKDPVNKSGGKAKKKKWSKGKVRDKLNNLVLFDKATYDKLCKEVPNYKLITPAVVSERLKIRGSLARAALQELLSKGLIKLVSKHRAQVIYTRNTKGGDAPAAGEDA,1,124,124,PPKDDKKKKDAGKSAKKDKDPVNKSGGKAKKKKWSKGKVRDKLNNLVLFDKATYDKLCKEVPNYKLITPAVVSERLKIRGSLARAALQELLSKGLIKLVSKHRAQVIYTRNTKGGDAPAAGEDA,13630.68912469,13638.98778,,PSI-MOD:429@2,,,0
11872,RL30_HUMAN,P62888,60S ribosomal protein L30,P62888,,MVAAKKTKKSLESINSRLQLVMKSGKYVLGYKQTLKMIRQGKAKLVILANNCPALRKSEIEYYAMLAKTGVHHYSGNNIELGTACGKYYRVCTLAIIDPGDSDIIRSMPEQTGEK,0,114,115,MVAAKKTKKSLESINSRLQLVMKSGKYVLGYKQTLKMIRQGKAKLVILANNCPALRKSEIEYYAMLAKTGVHHYSGNNIELGTACGKYYRVCTLAIIDPGDSDIIRSMPEQTGEK,12775.74142469,12784.05058,,,,,0
11873,RL40_HUMAN,P62987,Ubiquitin-60S ribosomal protein L40,P62987,,MQIFVKTLTGKTITLEVEPSDTIENVKAKIQDKEGIPPDQQRLIFAGKQLEDGRTLSDYNIQKESTLHLVLRLRGGIIEPSLRQLAQKYNCDKMICRKCYARLHPRAVNCRKKKCGHTNNLRPKKKVK,76,127,52,IIEPSLRQLAQKYNCDKMICRKCYARLHPRAVNCRKKKCGHTNNLRPKKKVK,6218.39130031,6222.55820362,,PSI-MOD:855@16,,,0
11874,RL36A_HUMAN,P83881,60S ribosomal protein L36a,P83881,,MVNVPKTRRTFCKKCGKHQPHKVTQYKKGKDSLYAQGKRRYDRKQSGYGGQTKPIFRKKAKTTKKIVLRLECVEPNCRSKRMLAIKRCKHFELGGDKKRKGQVIQF,1,105,105,VNVPKTRRTFCKKCGKHQPHKVTQYKKGKDSLYAQGKRRYDRKQSGYGGQTKPIFRKKAKTTKKIVLRLECVEPNCRSKRMLAIKRCKHFELGGDKKRKGQVIQF,12315.78686469,12323.65878,,PSI-MOD:85@51,,,0
11875,SLIRP_HUMAN,Q9GZT3,SRA stem-loop-interacting RNA-binding protein; mitochondrial,Q9GZT3-1,1,MAASAARGAAALRRSINQPVAFVRRIPWTAASSQLKEHFAQFGHVRRCILPFDKETGFHRGLGWVQFSSEEGLRNALQQENHIIDGVKVQVHTRRPKLPQTSDDEKKDF,0,108,109,MAASAARGAAALRRSINQPVAFVRRIPWTAASSQLKEHFAQFGHVRRCILPFDKETGFHRGLGWVQFSSEEGLRNALQQENHIIDGVKVQVHTRRPKLPQTSDDEKKDF,12341.42378469,12349.01608,,,,,1
11876,L10K_HUMAN,Q9UNZ5,Leydig cell tumor 10 kDa protein homolog,Q9UNZ5,,MAQGQRKFQAHKPAKSKTAAAASEKNRGPRKGGRVIAPKKARVVQQQKLKKNLEVGIRKKIEHDVVMKASSSLPKKLALLKAPAKKKGAAAATSSKTPS,0,98,99,MAQGQRKFQAHKPAKSKTAAAASEKNRGPRKGGRVIAPKKARVVQQQKLKKNLEVGIRKKIEHDVVMKASSSLPKKLALLKAPAKKKGAAAATSSKTPS,10570.11311469,10576.58958,,,,,0
