PFR,UniProt Id,Entry Accession,Entry Description,Isoform Accession,Isoform Description,Isoform Sequence,Start,End,Length,Proteoform Sequence,Monoisotopic Mass,Average Mass,Sequence Modifications,PTMs,N-Terminal,C-Terminal,Star
68709,3L22H_OPHHA,A8N285,Long neurotoxin LNTX-2 homolog,A8N285,3L22H_OPHHA Long neurotoxin LNTX-2 homolog OS=Ophiophagus hannah PE=3 SV=1,MKTLLLTLVVVTIVCLDLGYTTKCYVTPDATSQTCPDGENICYTKSWCDVFCSSRGKRIDLGCAATCPKVKPGVDIKCCSTDNCNPFTPWKRH,21,92,72,TKCYVTPDATSQTCPDGENICYTKSWCDVFCSSRGKRIDLGCAATCPKVKPGVDIKCCSTDNCNPFTPWKRH,7947.60832469,7953.09038,,,,,1
68710,3L22H_OPHHA,A8N285,Long neurotoxin LNTX-2 homolog,A8N285,3L22H_OPHHA Long neurotoxin LNTX-2 homolog OS=Ophiophagus hannah PE=3 SV=1,MKTLLLTLVVVTIVCLDLGYTTKCYVTPDATSQTCPDGENICYTKSWCDVFCSSRGKRIDLGCAATCPKVKPGVDIKCCSTDNCNPFTPWKRH,21,90,70,TKCYVTPDATSQTCPDGENICYTKSWCDVFCSSRGKRIDLGCAATCPKVKPGVDIKCCSTDNCNPFTPWK,7654.44830469,7659.76178,,,,,1
68711,3L22H_OPHHA,A8N285,Long neurotoxin LNTX-2 homolog,A8N285,3L22H_OPHHA Long neurotoxin LNTX-2 homolog OS=Ophiophagus hannah PE=3 SV=1,MKTLLLTLVVVTIVCLDLGYTTKCYVTPDATSQTCPDGENICYTKSWCDVFCSSRGKRIDLGCAATCPKVKPGVDIKCCSTDNCNPFTPWKRH,21,89,69,TKCYVTPDATSQTCPDGENICYTKSWCDVFCSSRGKRIDLGCAATCPKVKPGVDIKCCSTDNCNPFTPW,7526.35334469,7531.58768,,,,,1
68712,3L22H_OPHHA,A8N285,Long neurotoxin LNTX-2 homolog,A8N285,3L22H_OPHHA Long neurotoxin LNTX-2 homolog OS=Ophiophagus hannah PE=3 SV=1,MKTLLLTLVVVTIVCLDLGYTTKCYVTPDATSQTCPDGENICYTKSWCDVFCSSRGKRIDLGCAATCPKVKPGVDIKCCSTDNCNPFTPWKRH,21,92,72,TKCYVTPDATSQTCPDGENICYTKTWCDVFCSSRGKRIDLGCAATCPKVKPGVDIKCCSTDNCNPFTPWKRH,7961.62397469,7967.11728,PSI-MOD:26@45,,,,1
68713,3L22H_OPHHA,A8N285,Long neurotoxin LNTX-2 homolog,A8N285,3L22H_OPHHA Long neurotoxin LNTX-2 homolog OS=Ophiophagus hannah PE=3 SV=1,MKTLLLTLVVVTIVCLDLGYTTKCYVTPDATSQTCPDGENICYTKSWCDVFCSSRGKRIDLGCAATCPKVKPGVDIKCCSTDNCNPFTPWKRH,21,90,70,TKCYVTPDATSQTCPDGENICYTKTWCDVFCSSRGKRIDLGCAATCPKVKPGVDIKCCSTDNCNPFTPWK,7668.46395469,7673.78868,PSI-MOD:26@45,,,,1
68714,3SO8_OPHHA,A8N286,Haditoxin,A8N286,3SO8_OPHHA Haditoxin OS=Ophiophagus hannah PE=1 SV=1,MKTLLLTLVVVTIVYLDLGYTTKCYNHQSTTPETTEICPDSGYFCYKSSWIDGREGRIERGCTFTCPELTPNGKYVYCCRRDKCNQ,21,85,65,TKCYNHQSTTPETTEICPDSGYFCYKSSWIDGREGRIERGCTFTCPELTPNGKYVYCCRRDKCNQ,7537.33343468999,7542.41328,,,,,1
68715,F8J2D9_DRYCN,F8J2D9,Putative long chain neurotoxin 346,F8J2D9,F8J2D9_DRYCN Putative long chain neurotoxin 346 OS=Drysdalia coronoides PE=2 SV=1,MKTLLLTLVVVTIVCLDLAYTRKCYKTHPYKSEPCASGENLCYTKTWCDFRCSRLGKAVELGCAATCPTTKPYEEVTCCSTDDCNRFPNWERPRPRPRGLLSSITDHP,21,48,27,KCYKTHPYKSEPCASGENLCYTKTWCD,3154.36567469,3156.56778,,,,,1
68716,3L22_OPHHA,P01386,Long neurotoxin 2,P01386,3L22_OPHHA Long neurotoxin 2 OS=Ophiophagus hannah PE=1 SV=1,TKCYVTPDATSQTCPDGQDICYTKTWCDGFCSSRGKRIDLGCAATCPKVKPGVDIKCCSTDNCNPFPTWKRKH,0,68,69,TKCYVTPDATSQTCPDGQDICYTKTWCDGFCSSRGKRIDLGCAATCPKVKPGVDIKCCSTDNCNPFPTW,7498.32204469,7503.53388,,,,,1
68717,3L21_OPHHA,P01387,Long neurotoxin 1,P01387,3L21_OPHHA Long neurotoxin 1 OS=Ophiophagus hannah PE=1 SV=1,TKCYVTPDVKSETCPAGQDICYTETWCDAWCTSRGKRVDLGCAATCPIVKPGVEIKCCSTDNCNPFPTWRKRP,0,67,68,TKCYVTPDVKSETCPAGQDICYTETWCDAWCTSRGKRVDLGCAATCPIVKPGVEIKCCSTDNCNPFPT,7377.29442469,7382.43568,,,,,1
68718,3L21_NAJAC,P01389,Long neurotoxin 1,P01389,3L21_NAJAC Long neurotoxin 1 OS=Naja anchietae PE=1 SV=1,IRCFITPDVTSQACPDGQNICYTKTWCDNFCGMRGKRVDLGCAATCPTVKPGVDIKCCSTDNCNPFPTRERS,0,68,69,IRCFITPDVTSQACPDGQNICYTKTWCDNFCGMRGKRVDLGCAATCPTVKPGVDIKCCSTDNCNPFPTR,7533.40025469,7538.69018,,,,,1
68719,3S11A_OPHHA,P01412,Weak toxin DE-1,P01412,3S11A_OPHHA Weak toxin DE-1 OS=Ophiophagus hannah PE=1 SV=2,MKTLLLTLVVVTIVCLDLGYSLICFNQETYRPETTTTCPDGEDTCYSTFWNDHHGVKIERGCGCPRVNPPISIICCKTDKCNN,21,82,62,LICFNQETYRPETTTTCPDGEDTCYSTFWNDHHGVKIERGCGCPRVNPPISIICCKTDKCNN,7022.12057469,7026.88708,,,,,1
68720,3S11A_OPHHA,P01412,Weak toxin DE-1,P01412,3S11A_OPHHA Weak toxin DE-1 OS=Ophiophagus hannah PE=1 SV=2,MKTLLLTLVVVTIVCLDLGYSLICFNQETYRPETTTTCPDGEDTCYSTFWNDHHGVKIERGCGCPRVNPPISIICCKTDKCNN,21,82,62,LICFNQETYRPETTTTCPDGEDTCYSTFWNDHHGVKIERGCGCPRVNPPISIICCKTDKCNN,7004.11000969,7008.86708,,PSI-MOD:420@20,,,1
68721,3L24_OPHHA,P80156,Long neurotoxin 4,P80156,3L24_OPHHA Long neurotoxin 4 OS=Ophiophagus hannah PE=1 SV=1,TKCYKTGDRIISEACPPGQDLCYMKTWCDVFCGTRGRVIELGCTATCPTVKPHEQITCCSTDNCNPHPKMKQ,0,71,72,TKCYKTGDRIISEACPPGQDLCYMKTWCDVFCGTRGRVIELGCTATCPTVKPHEQITCCSTDNCNPHPKMKQ,8008.64671469,8014.29398,,,,,1
68722,3L24_OPHHA,P80156,Long neurotoxin 4,P80156,3L24_OPHHA Long neurotoxin 4 OS=Ophiophagus hannah PE=1 SV=1,TKCYKTGDRIISEACPPGQDLCYMKTWCDVFCGTRGRVIELGCTATCPTVKPHEQITCCSTDNCNPHPKMKQ,0,69,70,TKCYKTGDRIISEACPPGQDLCYMKTWCDVFCGTRGRVIELGCTATCPTVKPHEQITCCSTDNCNPHPKM,7752.49317469,7757.98918,,,,,1
68723,3L26_OPHHA,P82662,Alpha-elapitoxin-Oh2b,P82662,3L26_OPHHA Alpha-elapitoxin-Oh2b OS=Ophiophagus hannah PE=1 SV=2,MKTLLLTLVVMTIVCLDLGYTLICFISSHDSVTCAPGENVCFLKSWCDAWCGSRGKKLSFGCAATCPKVNPGIDIECCSTDNCNPHPKLRP,21,90,70,LICFISSHDSVTCAPGENVCFLKSWCDAWCGSRGKKLSFGCAATCPKVNPGIDIECCSTDNCNPHPKLRP,7528.44307469,7533.69838,,,,,1
68724,3L26_OPHHA,P82662,Alpha-elapitoxin-Oh2b,P82662,3L26_OPHHA Alpha-elapitoxin-Oh2b OS=Ophiophagus hannah PE=1 SV=2,MKTLLLTLVVMTIVCLDLGYTLICFISSHDSVTCAPGENVCFLKSWCDAWCGSRGKKLSFGCAATCPKVNPGIDIECCSTDNCNPHPKLRP,21,89,69,LICFISSHDSVTCAPGENVCFLKSWCDAWCGSRGKKLSFGCAATCPKVNPGIDIECCSTDNCNPHPKLR,7431.39031469,7436.58168,,,,,1
68725,3L26_OPHHA,P82662,Alpha-elapitoxin-Oh2b,P82662,3L26_OPHHA Alpha-elapitoxin-Oh2b OS=Ophiophagus hannah PE=1 SV=2,MKTLLLTLVVMTIVCLDLGYTLICFISSHDSVTCAPGENVCFLKSWCDAWCGSRGKKLSFGCAATCPKVNPGIDIECCSTDNCNPHPKLRP,21,88,68,LICFISSHDSVTCAPGENVCFLKSWCDAWCGSRGKKLSFGCAATCPKVNPGIDIECCSTDNCNPHPKL,7275.28920469,7280.39418,,,,,1
68726,3L26_OPHHA,P82662,Alpha-elapitoxin-Oh2b,P82662,3L26_OPHHA Alpha-elapitoxin-Oh2b OS=Ophiophagus hannah PE=1 SV=2,MKTLLLTLVVMTIVCLDLGYTLICFISSHDSVTCAPGENVCFLKSWCDAWCGSRGKKLSFGCAATCPKVNPGIDIECCSTDNCNPHPKLRP,21,87,67,LICFISSHDSVTCAPGENVCFLKSWCDAWCGSRGKKLSFGCAATCPKVNPGIDIECCSTDNCNPHPK,7162.20514469,7167.23478,,,,,1
68727,3L26_OPHHA,P82662,Alpha-elapitoxin-Oh2b,P82662,3L26_OPHHA Alpha-elapitoxin-Oh2b OS=Ophiophagus hannah PE=1 SV=2,MKTLLLTLVVMTIVCLDLGYTLICFISSHDSVTCAPGENVCFLKSWCDAWCGSRGKKLSFGCAATCPKVNPGIDIECCSTDNCNPHPKLRP,21,86,66,LICFISSHDSVTCAPGENVCFLKSWCDAWCGSRGKKLSFGCAATCPKVNPGIDIECCSTDNCNPHP,7034.11018469,7039.06068,,,,,1
68728,3SO3_CAURH,P84716,Neurotoxin-like protein 1,P84716,3SO3_CAURH Neurotoxin-like protein 1 OS=Causus rhombeatus PE=1 SV=1,MKCLTKYSRVSETSQTCHVWQNLCFKKWQKGKKVSRGCTATCPKPKKDEVIQCCAKDKCNK,0,60,61,MKCLTKYSRVSETSQTCHVWQNLCFKKWQKGKKVSRGCTATCPKPKKDEVIQCCAKDKCNK,7037.48478469,7042.35698,,,,,1
68729,3SIM6_OPHHA,Q2VBN1,Muscarinic toxin MTX6,Q2VBN1,3SIM6_OPHHA Muscarinic toxin MTX6 OS=Ophiophagus hannah PE=3 SV=1,MKTLLLTLVVVTILCLDLGYTLTCLTHESLFFETTETCSDGQNLCYAKWFAVFPGARRPDGGCAATCPDKVPLEIVNCCTTDKCNL,21,85,65,LTCLTHESLFFETTETCSDGQNLCYAKWFAVFPGARRPDGGCAATCPDKVPLEIVNCCTTDKCNL,7102.23344469,7107.09738,,,,,1
68730,3SX3_OPHHA,Q2VBN3,Weak neurotoxin WNTX33,Q2VBN3,3SX3_OPHHA Weak neurotoxin WNTX33 OS=Ophiophagus hannah PE=3 SV=1,MKTLLLTLVVVTIVCLDLGYSLICFNQETYRPETTTTCPDGEDTCYSTFWNDHRGVKIERGCGCPRVNPGISIICCKTDKCNN,21,82,62,LICFNQETYRPETTTTCPDGEDTCYSTFWNDHRGVKIERGCGCPRVNPRISIICCKTDKCNN,7100.21112469,7105.00428,PSI-MOD:11@69,,,,1
68731,3SDC9_OPHHA,Q2VBN8,Beta-cardiotoxin CTX9,Q2VBN8,3SDC9_OPHHA Beta-cardiotoxin CTX9 OS=Ophiophagus hannah PE=1 SV=1,MKTLLLTLVVVTIVCLDLGYTRKCLNTPLPLIYKTCPIGQDRCIKMTIKKLPSKYDVIRGCIDICPKSSADVEVLCCDTNKCNK,21,83,63,RKCLNTPLPLIYKTCPIGQDRCIKMTIKKLPSKYDVIRGCIDICPKSSADVEVLCCDTNKCNK,7084.61845469,7089.53198,,,,,1
68732,3L23X_OPHHA,Q2VBP3,Long neurotoxin LNTX37,Q2VBP3,3L23X_OPHHA Long neurotoxin LNTX37 OS=Ophiophagus hannah PE=3 SV=1,MKTLLLTLVVVTIMCLDLGYTTKCYKTGERIISETCPPGQDLCYMKTWCDVFCGSRGRVIELGCTATCPTVKHHEQITCCSTDNCNPHPKMKQR,22,92,71,KCYKTGERIISETCPPGQDLCYMKTWCDVFCGSRGRVIELGCTATCPTVKHHEQITCCSTDNCNPHPKMKQ,7977.61575469,7983.23958,,,,,1
68733,3L228_OPHHA,Q2VBP4,Long neurotoxin LNTX28,Q2VBP4,3L228_OPHHA Long neurotoxin LNTX28 OS=Ophiophagus hannah PE=1 SV=1,MKTLLLTLVVMTIVCLDLGYTLICFISSHDSVTCAPGENVCFLKSWCDAWCGSRGKKLSFGCAATCPRVNPGIDIECCSTDNCNPHPKLRP,21,90,70,LICFISSHDSVTCAPGENVCFLKSWCDAWCGSRGKKLSFGCAATCPRVNPGIDIECCSTDNCNPHPKLRP,7556.44922469,7561.71178,,,,,1
68734,3L228_OPHHA,Q2VBP4,Long neurotoxin LNTX28,Q2VBP4,3L228_OPHHA Long neurotoxin LNTX28 OS=Ophiophagus hannah PE=1 SV=1,MKTLLLTLVVMTIVCLDLGYTLICFISSHDSVTCAPGENVCFLKSWCDAWCGSRGKKLSFGCAATCPRVNPGIDIECCSTDNCNPHPKLRP,21,90,70,LICFISSHDSVTCAPGENVCFLKSWCDAWCGSRGKKLSFGCAATCPKVNPGIDIECCSTDNCNPHPKLRP,7528.44307469,7533.69838,PSI-MOD:21@67,,,,1
68735,3L228_OPHHA,Q2VBP4,Long neurotoxin LNTX28,Q2VBP4,3L228_OPHHA Long neurotoxin LNTX28 OS=Ophiophagus hannah PE=1 SV=1,MKTLLLTLVVMTIVCLDLGYTLICFISSHDSVTCAPGENVCFLKSWCDAWCGSRGKKLSFGCAATCPRVNPGIDIECCSTDNCNPHPKLRP,21,88,68,LICFISSHDSVTCAPGENVCFLKSWCDAWCGSRGKKLSFGCAATCPKVNPGIDIECCSTDNCNPHPKL,7275.28920469,7280.39418,PSI-MOD:21@67,,,,1
68736,3L228_OPHHA,Q2VBP4,Long neurotoxin LNTX28,Q2VBP4,3L228_OPHHA Long neurotoxin LNTX28 OS=Ophiophagus hannah PE=1 SV=1,MKTLLLTLVVMTIVCLDLGYTLICFISSHDSVTCAPGENVCFLKSWCDAWCGSRGKKLSFGCAATCPRVNPGIDIECCSTDNCNPHPKLRP,21,87,67,LICFISSHDSVTCAPGENVCFLKSWCDAWCGSRGKKLSFGCAATCPKVNPGIDIECCSTDNCNPHPK,7162.20514469,7167.23478,PSI-MOD:21@67,,,,1
68737,3L222_OPHHA,Q2VBP5,Long neurotoxin LNTX22,Q2VBP5,3L222_OPHHA Long neurotoxin LNTX22 OS=Ophiophagus hannah PE=1 SV=1,MKTLLLTLVVVTIVCLDLGYTTKCYVTPDVKSETCPDGENICYTKSWCEVFCTSRGKRIDLGRAATCPKVKPGVDIKCCSTDNCNPFTPWKRH,21,92,72,TKCYVTPDVKSETCPDGENICYTKSWCEVFCTSRGKRIDLGGAATCPKVKPGVDIKCCSTDNCNPFTPWKRH,7985.71448469,7991.16488,PSI-MOD:17@62,,,,1
68738,3L222_OPHHA,Q2VBP5,Long neurotoxin LNTX22,Q2VBP5,3L222_OPHHA Long neurotoxin LNTX22 OS=Ophiophagus hannah PE=1 SV=1,MKTLLLTLVVVTIVCLDLGYTTKCYVTPDVKSETCPDGENICYTKSWCEVFCTSRGKRIDLGRAATCPKVKPGVDIKCCSTDNCNPFTPWKRH,21,92,72,TKCYVTPDVKSETCPDGENICYTEKWCEQFCTSRGKRIDLGGAATCPKANPGVDIKCCSTDNCNPFTPRKRP,7944.64753468999,7950.02608,PSI-MOD:15@44|PSI-MOD:21@45|PSI-MOD:16@49|PSI-MOD:17@62|PSI-MOD:10@69|PSI-MOD:12@70|PSI-MOD:11@89|PSI-MOD:24@92,,,,1
68739,3L2X8_OPHHA,Q2VBP6,Long neurotoxin LNTX8,Q2VBP6,3L2X8_OPHHA Long neurotoxin LNTX8 OS=Ophiophagus hannah PE=3 SV=1,MKTLLLTLVVVTIMCLDLGYTTKCYKTGERIISETCPPGQDLCYMKTWCDVFCGSRGRVVELGCTATCPTVKPHEQITCCSTDNCNPHPKMKQR,21,92,72,TKCYKTGERIISETCPPGQDLCYMKTWCDVFCGSRGRVVELGCTATCPTVKPHEQITCCSTDNCNPHPKMKQ,8024.64163469,8030.29348,,,,,1
68740,3L2X1_OPHHA,Q2VBP8,Long neurotoxin LNTX1,Q2VBP8,3L2X1_OPHHA Long neurotoxin LNTX1 OS=Ophiophagus hannah PE=3 SV=1,MKILLLTLVVVTIMCLDLGYTTKCYKTGERIISETCPPGQDLCYMKTWCDVFCGSRGRVIELGCTATCPTVKPHEQITCCSTDNCNPHPKMKQR,21,92,72,TKCYKTGERIISETCPPGQDLCYMKTWCDVFCGSRGRVIELGCTATCPTVKPHEQITCCSTDNCNPHPKMKQ,8038.65728469,8044.32028,,,,,1
68741,3SDC5_OPHHA,Q53B46,Beta-cardiotoxin CTX15,Q53B46,3SDC5_OPHHA Beta-cardiotoxin CTX15 OS=Ophiophagus hannah PE=1 SV=1,MKTLLLTLVVVTIVCLDLGYTRKCLNTPLPLIYKTCPIGQDKCIKMTIKKLPSKYDVIRGCIDICPKSSADVEVLCCDTNKCNK,21,83,63,RKCLNTPLPLIYKTCPIGQDKCIKMTIKKLPSKYDVIRGCIDICPKSSADVEVLCCDTNKCNK,7056.61230469,7061.51858,,,,,1
68742,3SI35_OPHHA,Q53B49,Short neurotoxin OH-35,Q53B49,3SI35_OPHHA Short neurotoxin OH-35 OS=Ophiophagus hannah PE=1 SV=1,MKTLLLTLVVVTIVCLDLGHTLICVKQYTIFGVTPEICADGQNLCYKTWHMVYPGGYDHTRGCAATCPKMKNHDTVHCCTTDKCNL,21,85,65,LICVKQYTIFGVTPEICADGQNLCYKTWHMVYPGGYDHTRGCAATCPKMKNHDTVHCCTTDKCNL,7294.31030469,7299.44338,,,,,1
68743,3SI35_OPHHA,Q53B49,Short neurotoxin OH-35,Q53B49,3SI35_OPHHA Short neurotoxin OH-35 OS=Ophiophagus hannah PE=1 SV=1,MKTLLLTLVVVTIVCLDLGHTLICVKQYTIFGVTPEICADGQNLCYKTWHMVYPGGYDHTRGCAATCPKMKNHDTVHCCTTDKCNL,21,85,65,LICVKQYTIFGVTPEICADGQNLCYKTWHMVYPGGYDHTRGCAATCPKMKNHDTVHCCTTDKCNL,7295.29432069,7300.42338,,PSI-MOD:400@39,,,1
68744,3L234_OPHHA,Q53B53,Long neurotoxin OH-34 (Fragment),Q53B53,3L234_OPHHA Long neurotoxin OH-34 (Fragment) OS=Ophiophagus hannah PE=1 SV=1,KTLLLTLVVVTILCLDLGYTTKCYITPDVKSETCPDGENICYTKTWCDVWCGSRGRRVDLGCAATCPIVKPGVNINCCSTDNCNPFPKRS,20,89,70,TKCYITPDVKSETCPDGENICYTKTWCDVWCGSRGRRVDLGCAATCPIVKPGVNINCCSTDNCNPFPKRS,7687.49223469,7692.79758,,,,,1
68745,3L257_OPHHA,Q53B56,Long neurotoxin OH-57,Q53B56,3L257_OPHHA Long neurotoxin OH-57 OS=Ophiophagus hannah PE=3 SV=1,MKTLLLTLVVVTIVCLDLGYTRICHKSSFISETCPDGQNLCYLKSWCDIFCGSRGERLEFGCAATCPEVKPGVNIECCSTDNCNPHPKLRP,21,90,70,RICHKSSFISETCPDGQNLCYLKSWCDIFCGSRGERLEFGCAATCPEVKPGVNIECCSTDNCNPHPKLRP,7761.51910469,7766.88228,,,,,1
68746,3L257_OPHHA,Q53B56,Long neurotoxin OH-57,Q53B56,3L257_OPHHA Long neurotoxin OH-57 OS=Ophiophagus hannah PE=3 SV=1,MKTLLLTLVVVTIVCLDLGYTRICHKSSFISETCPDGQNLCYLKSWCDIFCGSRGERLEFGCAATCPEVKPGVNIECCSTDNCNPHPKLRP,21,88,68,RICHKSSFISETCPDGQNLCYLKSWCDIFCGSRGERLEFGCAATCPEVKPGVNIECCSTDNCNPHPKL,7508.36523469,7513.57808,,,,,1
68747,3L255_OPHHA,Q53B58,Long neurotoxin OH-55,Q53B58,3L255_OPHHA Long neurotoxin OH-55 OS=Ophiophagus hannah PE=1 SV=1,MKTLLLTLVVVTIVCLDLGYTTKCYVTPDVKSETCPAGQDICYTETWCDAWCTSRGKRVNLGCAATCPIVKPGVEIKCCSTDNCNPFPTRKRP,21,92,72,TKCYVTPDVKSETCPAGQDICYTETWCDAWCTSRGKRVNLGCAATCPIVKPGVEIKCCSTDNCNPFPTRKRP,7913.66035469,7919.11668,,,,,1
68748,3L255_OPHHA,Q53B58,Long neurotoxin OH-55,Q53B58,3L255_OPHHA Long neurotoxin OH-55 OS=Ophiophagus hannah PE=1 SV=1,MKTLLLTLVVVTIVCLDLGYTTKCYVTPDVKSETCPAGQDICYTETWCDAWCTSRGKRVNLGCAATCPIVKPGVEIKCCSTDNCNPFPTRKRP,21,89,69,TKCYVTPDVKSETCPAGQDICYTETWCDAWCTSRGKRVNLGCAATCPIVKPGVEIKCCSTDNCNPFPTR,7532.41152469,7537.63838,,,,,1
68749,3L255_OPHHA,Q53B58,Long neurotoxin OH-55,Q53B58,3L255_OPHHA Long neurotoxin OH-55 OS=Ophiophagus hannah PE=1 SV=1,MKTLLLTLVVVTIVCLDLGYTTKCYVTPDVKSETCPAGQDICYTETWCDAWCTSRGKRVNLGCAATCPIVKPGVEIKCCSTDNCNPFPTRKRP,21,88,68,TKCYVTPDVKSETCPAGQDICYTETWCDAWCTSRGKRVNLGCAATCPIVKPGVEIKCCSTDNCNPFPT,7376.31041469,7381.45088,,,,,1
68750,3L255_OPHHA,Q53B58,Long neurotoxin OH-55,Q53B58,3L255_OPHHA Long neurotoxin OH-55 OS=Ophiophagus hannah PE=1 SV=1,MKTLLLTLVVVTIVCLDLGYTTKCYVTPDVKSETCPAGQDICYTETWCDAWCTSRGKRVNLGCAATCPIVKPGVEIKCCSTDNCNPFPTRKRP,21,87,67,TKCYVTPDVKSETCPAGQDICYTETWCDAWCTSRGKRVNLGCAATCPIVKPGVEIKCCSTDNCNPFP,7275.26273469,7280.34578,,,,,1
68751,3L255_OPHHA,Q53B58,Long neurotoxin OH-55,Q53B58,3L255_OPHHA Long neurotoxin OH-55 OS=Ophiophagus hannah PE=1 SV=1,MKTLLLTLVVVTIVCLDLGYTTKCYVTPDVKSETCPAGQDICYTETWCDAWCTSRGKRVNLGCAATCPIVKPGVEIKCCSTDNCNPFPTRKRP,21,92,72,TKCYVTPDVKSETCPDGQDICYTETWCDVWCTSRGKRVNLGCAATCPKANPGVDILCCSTDNCNPFPTRKRP,7929.58250469,7935.02927999999,PSI-MOD:13@36|PSI-MOD:29@49|PSI-MOD:21@68|PSI-MOD:10@69|PSI-MOD:12@70|PSI-MOD:13@74|PSI-MOD:20@76,,,,1
68752,3L237_OPHHA,Q53B59,Long neurotoxin OH-37,Q53B59,3L237_OPHHA Long neurotoxin OH-37 OS=Ophiophagus hannah PE=1 SV=1,MKTLLLTLVVMTIVCLDLGYSLICFISPHDSVTCAPGENVCFLKSWCDAWCGSRGKKLSFGCAATCPKVNPGIDIECCSTDNCNPHPKLRP,21,90,70,LICFISPHDSVTCAPGENVCFLKSWCDAWCGSRQKKLSFGCAATCPKVNPGIDIECCSTDNCNPHPKLRP,7609.50092469,7614.81568,PSI-MOD:16@54,,,,1
68753,3L237_OPHHA,Q53B59,Long neurotoxin OH-37,Q53B59,3L237_OPHHA Long neurotoxin OH-37 OS=Ophiophagus hannah PE=1 SV=1,MKTLLLTLVVMTIVCLDLGYSLICFISPHDSVTCAPGENVCFLKSWCDAWCGSRGKKLSFGCAATCPKVNPGIDIECCSTDNCNPHPKLRP,21,88,68,LICFISPHDSVTCAPGENVCFLKSWCDAWCGSRQKKLSFGCAATCPKVNPGIDIECCSTDNCNPHPKL,7356.34705469,7361.51148,PSI-MOD:16@54,,,,1
68754,3L237_OPHHA,Q53B59,Long neurotoxin OH-37,Q53B59,3L237_OPHHA Long neurotoxin OH-37 OS=Ophiophagus hannah PE=1 SV=1,MKTLLLTLVVMTIVCLDLGYSLICFISPHDSVTCAPGENVCFLKSWCDAWCGSRGKKLSFGCAATCPKVNPGIDIECCSTDNCNPHPKLRP,21,90,75,DLGYSLICFISPHDSVTCAPGENVCFLKSWCDAWCGSRGKKLSFGCAATCPKVNPGIDIECCSTDNCNPHPKLRP,8073.69162469,8079.29098,,,,,1
68755,3S11H_OPHHA,Q69CJ8,Weak toxin DE-1 homolog 1,Q69CJ8,3S11H_OPHHA Weak toxin DE-1 homolog 1 OS=Ophiophagus hannah PE=3 SV=1,MKPVLLTLVVVTIVCLDLGYTRICLKQEPFQPETTTTCPEGEDACYNLFWSDHSEIKIEMGCGCPKTEPYTNLYCCKIDSCNK,21,82,62,RICLKQEPFQPETTTTCPEGEDACYNLFWSDHSEIKIEMGCGCPKTEPYTNLYCCKIDSCNK,7109.12629469,7114.05788,,,,,1
68756,3SDC7_OPHHA,Q69CK0,Beta-cardiotoxin CTX27,Q69CK0,3SDC7_OPHHA Beta-cardiotoxin CTX27 OS=Ophiophagus hannah PE=1 SV=1,MKTLLLTLVVVTIVCLDLGYTRKCLNTPLPLIYTTCPIGQDKCVKMTIKKLPSKYDVIRGCIDICPKSSADVEVLCCDTNKCNK,21,83,63,RKCLNTPLPLIYTTCPIGQDKCVKMTIKKLPSKYDVIRGCIDICPKSSADVEVLCCDTNKCNK,7015.54937469,7020.42278,,,,,1
68757,3SDC7_OPHHA,Q69CK0,Beta-cardiotoxin CTX27,Q69CK0,3SDC7_OPHHA Beta-cardiotoxin CTX27 OS=Ophiophagus hannah PE=1 SV=1,MKTLLLTLVVVTIVCLDLGYTRKCLNTPLPLIYTTCPIGQDKCVKMTIKKLPSKYDVIRGCIDICPKSSADVEVLCCDTNKCNK,21,82,62,RKCLNTPLPLIYTTCPIGQDKCVKMTIKKLPSKYDVIRGCIDICPKSSADVEVLCCDTNKCN,6887.45441469,6892.24868,,,,,1
68758,V8N212_OPHHA,V8N212,Uncharacterized protein (Fragment),V8N212,V8N212_OPHHA Uncharacterized protein (Fragment) OS=Ophiophagus hannah GN=L345_18084 PE=4 SV=1,YTTKCYNHQSTTPETTEICPDSGYFCYKSSWIDGRVFFLLEPTLELPNAPENWRSRRTCLCPAWVPLRSHPVARQSKQCKERGSWTVVPRLSQQQPRLEGETFFRGRGREMLGEL,2,19,18,TKCYNHQSTTPETTEICP,2051.89284469,2053.24608,,,,,1
68759,V8N5J6_OPHHA,V8N5J6,Uncharacterized protein (Fragment),V8N5J6,V8N5J6_OPHHA Uncharacterized protein (Fragment) OS=Ophiophagus hannah GN=L345_17355 PE=4 SV=1,ENVITPPNPPFFPKPPCPSLLNLDLQPPQAGVEVYITVFSNPGLHFESCRGDCKMKALLFALLLVAFLFKDPVKSMECYRCGVTGCHLKITCSAEETFCYKWLNKISNDRWYGCAKTCTEQNTWRIYNKCCTTNLCNT,75,137,63,MECYRCGVTGCHLKITCSAEETFCYKWLNKISNDRWYGCAKTCTEQNTWRIYNKCCTTNLCNT,7400.25766469,7405.49888,,,,,1
68760,V8N6H4_OPHHA,V8N6H4,Uncharacterized protein (Fragment),V8N6H4,V8N6H4_OPHHA Uncharacterized protein (Fragment) OS=Ophiophagus hannah GN=L345_17130 PE=3 SV=1,MKTLLLTLVVVTIVCLDLATATATDLFFGIFKIIILLCASFTEYDVIRGCIDICPKSSADVEVLCCDTNKCNK,8,72,65,VVVTIVCLDLATATATDLFFGIFKIIILLCASFTEYDVIRGCIDICPKSSADVEVLCCDTNKCNK,7045.54460469,7050.36288,,,,,1
68761,V8N9N7_OPHHA,V8N9N7,Uncharacterized protein,V8N9N7,V8N9N7_OPHHA Uncharacterized protein OS=Ophiophagus hannah GN=L345_15308 PE=3 SV=1,MKTLLLTLVVVTIVCLDLGHTRICLTDYSKVSETIEICPDGQNFCFKKFPKGIPFLPWVNRGCAATCPKPEPKVYVDCCARDKCNR,21,85,65,RICLTDYSKVSETIEICPDGQNFCFKKFPKGIPFLPWVNRGCAATCPKPEPKVYVDCCARDKCNR,7396.58588469,7401.67648,,,,,1
68762,CRVP_OPHHA,Q7ZT98,Cysteine-rich venom protein ophanin,Q7ZT98,CRVP_OPHHA Cysteine-rich venom protein ophanin OS=Ophiophagus hannah PE=1 SV=1,MIAFTLLSLAAVLQQSFGNVDFNSESTRRQKKQKEIVDLHNSLRRSVSPTASNMLKMQWYPEAASNAERWASNCNLGHSPDYSRVLEGIECGENIYMSSNPRAWTEIIQLWHDEYKNFVYGVGANPPGSVTGHYTQIVWYKTYRIGCAVNYCPSSEYSYFYVCQYCPSGNMRGSTATPYKSGPTCGDCPSACDNGLCTNPCTLYNEYTNCDSLVKQSSCQDEWIKSKCPASCFCHNKII,18,238,221,NVDFNSESTRRQKKQKEIVDLHNSLRRSVSPTASNMLKMQWYPEAASNAERWASNCNLGHSPDYSRVLEGIECGENIYMSSNPRAWTEIIQLWHDEYKNFVYGVGANPPGSVTGHYTQIVWYKTYRIGCAVNYCPSSEYSYFYVCQYCPSGNMRGSTATPYKSGPTCGDCPSACDNGLCTNPCTLYNEYTNCDSLVKQSSCQDEWIKSKCPASCFCHNKII,24960.39505469,24976.88698,,,,,1
68763,V8NKT2_OPHHA,V8NKT2,Uncharacterized protein (Fragment),V8NKT2,V8NKT2_OPHHA Uncharacterized protein (Fragment) OS=Ophiophagus hannah GN=L345_12110 PE=4 SV=1,MYYPVEMIAFIFLLSLAAVLQQSSGTVDFASESSNKRENQKQIVDKHNALRRSVKPTARNMLQMEWNSNAAQNAKRWADRCSFAHSPPHLRTVGKFSCGENLFMSSQPYAWSRVIQSWYDENKKFVYGVGANPPGSVIGHYTQIVWYKSHLLGCAAARCSSSKYLYVCQYCPAGNIRGSIATPYKSGPPCGDCPSACVNGLCTNPCKYKDDFSNCQSLAKQTKCQTEWIKSKCPASCFCRTEII,31,87,57,ESSNKRENQKQIVDKHNALRRSVKPTARNMLQMEWNSNAAQNAKRWADRCSFAHSPP,6630.29043469,6634.41248,,,,,1
68764,A8QL55_OPHHA,A8QL55,Complement-depleting factor,A8QL55,A8QL55_OPHHA Complement-depleting factor OS=Ophiophagus hannah PE=2 SV=1,MEGMALYLVAALLIGFPGSSHGALYTLITPGVLRTDTEEQILVEAHGDNTPKQLDIFVHDFPRKQKILFQKRVDMNPAGDMLVTPTIKIPAEEVSKDSRQNQYVVVQVTGPQVRLEKVVLLSYQSGFVFIQTDKGIYTPGSPVLYRVFSMDHNMRQMDKTVVVEFQTPEGIVVSSNRIDLNFTRPYNLPELGSLGTWKIVAKYEHSPENYTAYFDVRKYVLPSFEVHLQPSEKSFYIDGNENFHVSITARYLYGEEVEGVAFVLFGVKIDGAKKSIPDSLTRIPILDGDGEATLKRDTLRSRFPNLNELVGHTLYASVTVITESGSDMVATEQSGIHIVTSPYQIYFTKTPKYFKPGMPYELTVYVTNPDGSPAAKVPVVSEAIHSEGTTLSDGTAKLILNTPLDTQSLLITVRTNHGDLPRERQATKSMTATAYQTQGGSGNYLHVAITSTEIKPGDNLPVNFNVRGNANSLNQVKYFTYLVGRQPKGAGQNLVAMNLRITPDLIPSFRFVAYYQVGNNEIVADSVWVDVKDTCMGMLVVKGASSRDNRIHMPGAAVKINWKGIQVLKSVLWLWIKQYMFSMINIKISQAKIWDTIEKSDFGCTAGSGQNNLGVFEDAGLALTTSTNLNTKQRSDTKCPQPANRRRSSSVLLLDSKASKAAQFQDQDLRKCCEDSMHENPMGYTCEKRAKYIQEGDACKAAFLECCRYIKGILDENQWESGLFLPRNDNEDGFIQDSDIIPRTDFPKSWLWHTVQLTEQPNSNGISSKTMSIYLKESITTWEVLAVSFTPTKGICVAEPYEITVMKDFFIDLRVPYSVVRNEQVEIRAVLYNYADEDIYVRVELLYNPAFCSASTEEQRYRQQFTIKALSSRAVPFVIVPLQQGLHDIEVRASVQGWESVSDGVKKKLKVVPEGVQKCIVTIIKLDPRAKGVDGTQREVVKARKLDDKVPGTEIETKITIQADPVAQIIENSIDGSKLNHLIITPSGCGEQNMIRMTAPVIATYYLDTTEQWETLGRNHRNEAVKQIMTGYAQQMVYKKANHSYAAFTNRASSTWLTAYVVKVFAMATKMVAGISHEIICGGVRWLILNRQQPDGAFKENAPVLSGTMQGGIQGDESEVTVTAFTLVALLESKTICNDSVNSLDSSIKKATDYLLKKYEKLQRPYTTALTAYALAAADRLNDDRVLMAASTGKNRWEEYNAHTHNVEGTSYALLALLKMKKFDQTGPIVRWLTDQNFYGGTYGQTQATVMLFQALAEYKIQMPTHKDLNLDIIIKLPERELPLHYRLDATNAILARTAETKLNQDFTVSASGDGTATMTILTVYNAQLQEKANVCNKFHLDVSVENIHLNFKHAKGAKGALMLKICMRYLGEVDSTMTIIDISMLTGFLPDAEDLTRLSEGVDRYISRYEVDNNMAQKVAVIIYLDKVSHSEDECLQFKILKHFEVGFIQPGSVKVYSYYNLDEQCTKFYHPDKGTGLLNKICVGNICRCAAETCSLLSQQEKIDLPLRIQKACASNVDYVYKTKLLRIEEKDGYDIYVMDVLEVIKPGTDENPQANARQYISQRKCQEALNLNVNDDYLIWGLRSDLWPMKDKFSYLITKNTWIERWPHEDECQDEEFQNLCLDFAHLSNILTIFGCPT,665,713,49,DQDLRKCCEDSMHENPMGYTCEKRAKYIQEGDACKAAFLECCRYIKGIL,5674.57257469,5678.53638,,,,,1
68765,VCO31_AUSSU,Q0ZZJ6,A.superbus venom factor 1,Q0ZZJ6,VCO31_AUSSU A.superbus venom factor 1 OS=Austrelaps superbus PE=1 SV=1,MEGMALYLVAALLIGFPGSSHGALYTLITPGVLRTDTEEQILVEAHGDSVPKQAVISIHDFPRRQKTLFQTRVDMNPAGGMLVTPTIKIPAKELNKESRQNQYVVVKVSGLPLELEKVVLLSYQSGFVFIQTDKGIYTPGSPVRYRVFSMDYNMHRMDKTVIVEFQTPEGVVVSSNPVNPSSVLIRPYNLPELVSFGTWKAVAKYEHSPEESYTAYFDVREYVLPSFEVRLQPSDKFLYIDGNKNFHVSITARYLYGKKVEGVAFVLFGVKIDDAKKSIPDSLTRIPIIDGDGEAILKRDTLRSRFQNLNELVGHTLYASVTVMTESGSDMVVTEQSGIHIVTSPYQIYFTKTPKYFKPGMPYELTVYVTNPDGSPAANVPVVSEAIRSEGTTLSDGTAKLILNTPLNTQSLPITVRTNHRDLPSERQATKSMTATAYQTQGGSGNYLHVAITSAEIKAGDNLPVNFNVRGNANSLNQIKYFTYLILTKGKIFKVGRQPKGEGQNLVTMNLRITPDLIPAFRFVAYYQVGNNEIVADSVWVDVKDTCMGTLVVKGASSRDNRIQKPGAAMKIKLEGDPGARVGLVAVDKAVYVLNDKYKISQAKIWDTIEKSDFGCTAGGGQNNLGVFEDAGLALTTSTNLNTKQRSVATCPQPTNRRRRSSVLLLDSKANKAAQFQDQNLRKCCEDGMHENPMGYTCEKRAKYIQEGDACKAAFLECCRYIKGIRDENQRESELFLARSDFEDELFGEDNIISRSDFPESWLWLTEDLKEPPNSQGISSKTLSFYLRDSITTWEVLAVSIAPTKGICVAEPYEITVMKDFFIDLRVPYSVVKNEQVEIRAVLYNYADEDIYVRVELLYNPAFCSASTEGQRYRVQVPVKALSSWAVPFVIVPLEQGLHDVEVKASVRGELASDGVRKKLKVVPEGERKNIVTVIELDPSVKGVDGTQEQTVIANKLDDKVPETEIETKISVLGDPVAQIIENSIDGSKLNHLIITPSGCGEQNMITMTPSVIATYYLDATGQWENLGVDRRTEAVKQIMKGYAQQMVYKKADHSYAAFPNRASSSWLTAYVVKVFAMAAKIVKDIKHEIICGGVKWLILNRQQPDGVFKENAPVIHGEMLGGTKGAEPEVSLTAFILTALLESRSVCNEHINILDSSINKAIDYLLKKYEKLQRPYTTALTAYALAAAERLNDDRVLMAASTGRDRWEEHNARTHNIEGTSYALLALLKMKKFAEAGPVVKWLIDQKYYGGTYGQTQATVMVFQALAEYEIQIPTHKDLNLDISINLPEREVPLRYSINYGNALVARTAETKLNEDFTVSASGDGKATMTILTVYNAQLREDANVCNKFHLDVSVENAQLNSKQAKGAKDTLRLKICTRYLGEVDSTMTIIDVSMLTGFLADAEDLTRLSKGVDRYISKFEIDNNMVQKGTVVIYLDKVSHSEVECLHFKIHKHFEVGFIQPGSVKVYSYYNLDEQCTKFYHPDKGTGLLNKICHGNICRCAEESCSLLNQQKKIDLQLRIQKACAPNVDYVYKTKLLQIEEKDGNDIYVMDVLEVIKGGTDRNPQAKARQYVSQRKCQEALNLKLNNDYLIWGLSSDLWPRKNDISYLITKNTWIERWPNEDECQDEEFQNLCDDFAQLSNTLTIFGCPT,990,1003,14,NHLIITPSGCGEQN,1481.69326469,1482.63098,,,,,1