PFR,UniProt Id,Entry Accession,Entry Description,Isoform Accession,Isoform Description,Isoform Sequence,Start,End,Length,Proteoform Sequence,Monoisotopic Mass,Average Mass,Sequence Modifications,PTMs,N-Terminal,C-Terminal,Star
1228,SMAP_HUMAN,O00193,Small acidic protein,O00193,,MSAARESHPHGVKRSASPDDDLGSSNWEAADLGNEERKQKFLRLMGAGKKEHTGRLVIGDHKSTSHFRTGEEDKKINEELESQYQQSMDSKLSGRYRRHCGLGFSEVEDHDGEGDVAGDDDDDDDDSPDPESPDDSESDSESEKEESAEELQAAEHPDEVEDPKNKKDAKSNYKMMFVKSSGS,1,182,182,SAARESHPHGVKRSASPDDDLGSSNWEAADLGNEERKQKFLRLMGAGKKEHTGRLVIGDHKSTSHFRTGEEDKKINEELESQYQQSMDSKLSGRYRRHCGLGFSEVEDHDGEGDVAGDDDDDDDDSPDPESPDDSESDSESEKEESAEELQAAEHPDEVEDPKNKKDAKSNYKMMFVKSSGS,20231.18536969,20243.37678,,RESID:51@0,,,1
1373,SMAP_HUMAN,O00193,Small acidic protein,O00193,,MSAARESHPHGVKRSASPDDDLGSSNWEAADLGNEERKQKFLRLMGAGKKEHTGRLVIGDHKSTSHFRTGEEDKKINEELESQYQQSMDSKLSGRYRRHCGLGFSEVEDHDGEGDVAGDDDDDDDDSPDPESPDDSESDSESEKEESAEELQAAEHPDEVEDPKNKKDAKSNYKMMFVKSSGS,1,182,182,SAARESHPHGVKRSASPDDDLGSSNWEAADLGNEERKQKFLRLMGAGKKEHTGRLVIGDHKSTSHFRTGEEDKKINEELESQYQQSMDSKLSGRYRRHCGLGFSEVEDHDGEGDVAGDDDDDDDDSPDPESPDDSESDSESEKEESAEELQAAEHPDEVEDPKNKKDAKSNYKMMFVKSSGS,20870.91601769,20883.21678,,RESID:51@0|RESID:37@23|RESID:37@103|RESID:37@130|RESID:37@134|RESID:37@136|RESID:37@138|RESID:37@140|RESID:37@145,,,1
1395,SMAP_HUMAN,O00193,Small acidic protein,O00193,,MSAARESHPHGVKRSASPDDDLGSSNWEAADLGNEERKQKFLRLMGAGKKEHTGRLVIGDHKSTSHFRTGEEDKKINEELESQYQQSMDSKLSGRYRRHCGLGFSEVEDHDGEGDVAGDDDDDDDDSPDPESPDDSESDSESEKEESAEELQAAEHPDEVEDPKNKKDAKSNYKMMFVKSSGS,1,182,182,SAARESHPHGVKRSASPDDDLGSSNWEAADLGNEERKQKFLRLMGAGKKEHTGRLVIGDHKSTSHFRTGEEDKKINEELESQYQQSMDSKLSGRYRRHCGLGFSEVEDHDGEGDVAGDDDDDDDDSPDPESPDDSESDSESEKEESAEELQAAEHPDEVEDPKNKKDAKSNYKMMFVKSSGS,20391.11803169,20403.33678,,RESID:51@0|RESID:37@138|RESID:37@145,,,1
1875,SMAP_HUMAN,O00193,Small acidic protein,O00193,,MSAARESHPHGVKRSASPDDDLGSSNWEAADLGNEERKQKFLRLMGAGKKEHTGRLVIGDHKSTSHFRTGEEDKKINEELESQYQQSMDSKLSGRYRRHCGLGFSEVEDHDGEGDVAGDDDDDDDDSPDPESPDDSESDSESEKEESAEELQAAEHPDEVEDPKNKKDAKSNYKMMFVKSSGS,1,182,182,SAARESHPHGVKRSASPDDDLGSSNWEAADLGNEERKQKFLRLMGAGKKEHTGRLVIGDHKSTSHFRTGEEDKKINEELESQYQQSMDSKLSGRYRRHCGLGFSEVEDHDGEGDVAGDDDDDDDDSPDPESPDDSESDSESEKEESAEELQAAEHPDEVEDPKNKKDAKSNYKMMFVKSSGS,20433.12859669,20445.37678,,RESID:51@0|RESID:37@15|RESID:37@130|RESID:55@177,,,1
1933,SMAP_HUMAN,O00193,Small acidic protein,O00193,,MSAARESHPHGVKRSASPDDDLGSSNWEAADLGNEERKQKFLRLMGAGKKEHTGRLVIGDHKSTSHFRTGEEDKKINEELESQYQQSMDSKLSGRYRRHCGLGFSEVEDHDGEGDVAGDDDDDDDDSPDPESPDDSESDSESEKEESAEELQAAEHPDEVEDPKNKKDAKSNYKMMFVKSSGS,1,182,182,SAARESHPHGVKRSASPDDDLGSSNWEAADLGNEERKQKFLRLMGAGKKEHTGRLVIGDHKSTSHFRTGEEDKKINEELESQYQQSMDSKLSGRYRRHCGLGFSEVEDHDGEGDVAGDDDDDDDDSPDPESPDDSESDSESEKEESAEELQAAEHPDEVEDPKNKKDAKSNYKMMFVKSSGS,20471.08436269,20483.31678,,RESID:51@0|RESID:37@23|RESID:37@138|RESID:37@145,,,1
2168,SMAP_HUMAN,O00193,Small acidic protein,O00193,,MSAARESHPHGVKRSASPDDDLGSSNWEAADLGNEERKQKFLRLMGAGKKEHTGRLVIGDHKSTSHFRTGEEDKKINEELESQYQQSMDSKLSGRYRRHCGLGFSEVEDHDGEGDVAGDDDDDDDDSPDPESPDDSESDSESEKEESAEELQAAEHPDEVEDPKNKKDAKSNYKMMFVKSSGS,1,182,182,SAARESHPHGVKRSASPDDDLGSSNWEAADLGNEERKQKFLRLMGAGKKEHTGRLVIGDHKSTSHFRTGEEDKKINEELESQYQQSMDSKLSGRYRRHCGLGFSEVEDHDGEGDVAGDDDDDDDDSPDPESPDDSESDSESEKEESAEELQAAEHPDEVEDPKNKKDAKSNYKMMFVKSSGS,20391.11803169,20403.33678,,RESID:51@0|RESID:37@15|RESID:37@136,,,1
2203,SMAP_HUMAN,O00193,Small acidic protein,O00193,,MSAARESHPHGVKRSASPDDDLGSSNWEAADLGNEERKQKFLRLMGAGKKEHTGRLVIGDHKSTSHFRTGEEDKKINEELESQYQQSMDSKLSGRYRRHCGLGFSEVEDHDGEGDVAGDDDDDDDDSPDPESPDDSESDSESEKEESAEELQAAEHPDEVEDPKNKKDAKSNYKMMFVKSSGS,1,182,182,SAARESHPHGVKRSASPDDDLGSSNWEAADLGNEERKQKFLRLMGAGKKEHTGRLVIGDHKSTSHFRTGEEDKKINEELESQYQQSMDSKLSGRYRRHCGLGFSEVEDHDGEGDVAGDDDDDDDDSPDPESPDDSESDSESEKEESAEELQAAEHPDEVEDPKNKKDAKSNYKMMFVKSSGS,20391.11803169,20403.33678,,RESID:51@0|RESID:37@23|RESID:37@145,,,1
2295,SMAP_HUMAN,O00193,Small acidic protein,O00193,,MSAARESHPHGVKRSASPDDDLGSSNWEAADLGNEERKQKFLRLMGAGKKEHTGRLVIGDHKSTSHFRTGEEDKKINEELESQYQQSMDSKLSGRYRRHCGLGFSEVEDHDGEGDVAGDDDDDDDDSPDPESPDDSESDSESEKEESAEELQAAEHPDEVEDPKNKKDAKSNYKMMFVKSSGS,1,182,182,SAARESHPHGVKRSASPDDDLGSSNWEAADLGNEERKQKFLRLMGAGKKEHTGRLVIGDHKSTSHFRTGEEDKKINEELESQYQQSMDSKLSGRYRRHCGLGFSEVEDHDGEGDVAGDDDDDDDDSPDPESPDDSESDSESEKEESAEELQAAEHPDEVEDPKNKKDAKSNYKMMFVKSSGS,20391.11803169,20403.33678,,RESID:51@0|RESID:37@15|RESID:37@138,,,1
2385,SMAP_HUMAN,O00193,Small acidic protein,O00193,,MSAARESHPHGVKRSASPDDDLGSSNWEAADLGNEERKQKFLRLMGAGKKEHTGRLVIGDHKSTSHFRTGEEDKKINEELESQYQQSMDSKLSGRYRRHCGLGFSEVEDHDGEGDVAGDDDDDDDDSPDPESPDDSESDSESEKEESAEELQAAEHPDEVEDPKNKKDAKSNYKMMFVKSSGS,1,182,182,SAARESHPHGVKRSASPDDDLGSSNWEAADLGNEERKQKFLRLMGAGKKEHTGRLVIGDHKSTSHFRTGEEDKKINEELESQYQQSMDSKLSGRYRRHCGLGFSEVEDHDGEGDVAGDDDDDDDDSPDPESPDDSESDSESEKEESAEELQAAEHPDEVEDPKNKKDAKSNYKMMFVKSSGS,20353.16226569,20365.39678,,RESID:51@0|RESID:37@13|RESID:55@172,,,1
2485,SMAP_HUMAN,O00193,Small acidic protein,O00193,,MSAARESHPHGVKRSASPDDDLGSSNWEAADLGNEERKQKFLRLMGAGKKEHTGRLVIGDHKSTSHFRTGEEDKKINEELESQYQQSMDSKLSGRYRRHCGLGFSEVEDHDGEGDVAGDDDDDDDDSPDPESPDDSESDSESEKEESAEELQAAEHPDEVEDPKNKKDAKSNYKMMFVKSSGS,1,182,182,SAARESHPHGVKRSASPDDDLGSSNWEAADLGNEERKQKFLRLMGAGKKEHTGRLVIGDHKSTSHFRTGEEDKKINEELESQYQQSMDSKLSGRYRRHCGLGFSEVEDHDGEGDVAGDDDDDDDDSPDPESPDDSESDSESEKEESAEELQAAEHPDEVEDPKNKKDAKSNYKMMFVKSSGS,20353.16226569,20365.39678,,RESID:51@0|RESID:37@15|RESID:55@177,,,1
2606,SMAP_HUMAN,O00193,Small acidic protein,O00193,,MSAARESHPHGVKRSASPDDDLGSSNWEAADLGNEERKQKFLRLMGAGKKEHTGRLVIGDHKSTSHFRTGEEDKKINEELESQYQQSMDSKLSGRYRRHCGLGFSEVEDHDGEGDVAGDDDDDDDDSPDPESPDDSESDSESEKEESAEELQAAEHPDEVEDPKNKKDAKSNYKMMFVKSSGS,1,182,182,SAARESHPHGVKRSASPDDDLGSSNWEAADLGNEERKQKFLRLMGAGKKEHTGRLVIGDHKSTSHFRTGEEDKKINEELESQYQQSMDSKLSGRYRRHCGLGFSEVEDHDGEGDVAGDDDDDDDDSPDPESPDDSESDSESEKEESAEELQAAEHPDEVEDPKNKKDAKSNYKMMFVKSSGS,20391.11803169,20403.33678,,RESID:51@0|RESID:37@13|RESID:37@140,,,1
2665,SMAP_HUMAN,O00193,Small acidic protein,O00193,,MSAARESHPHGVKRSASPDDDLGSSNWEAADLGNEERKQKFLRLMGAGKKEHTGRLVIGDHKSTSHFRTGEEDKKINEELESQYQQSMDSKLSGRYRRHCGLGFSEVEDHDGEGDVAGDDDDDDDDSPDPESPDDSESDSESEKEESAEELQAAEHPDEVEDPKNKKDAKSNYKMMFVKSSGS,1,182,182,SAARESHPHGVKRSASPDDDLGSSNWEAADLGNEERKQKFLRLMGAGKKEHTGRLVIGDHKSTSHFRTGEEDKKINEELESQYQQSMDSKLSGRYRRHCGLGFSEVEDHDGEGDVAGDDDDDDDDSPDPESPDDSESDSESEKEESAEELQAAEHPDEVEDPKNKKDAKSNYKMMFVKSSGS,20752.99392069,20765.29678,,RESID:51@0|RESID:37@15|RESID:37@130|RESID:37@134|RESID:37@136|RESID:37@138|RESID:37@145|RESID:55@172,,,1
2956,SMAP_HUMAN,O00193,Small acidic protein,O00193,,MSAARESHPHGVKRSASPDDDLGSSNWEAADLGNEERKQKFLRLMGAGKKEHTGRLVIGDHKSTSHFRTGEEDKKINEELESQYQQSMDSKLSGRYRRHCGLGFSEVEDHDGEGDVAGDDDDDDDDSPDPESPDDSESDSESEKEESAEELQAAEHPDEVEDPKNKKDAKSNYKMMFVKSSGS,1,182,182,SAARESHPHGVKRSASPDDDLGSSNWEAADLGNEERKQKFLRLMGAGKKEHTGRLVIGDHKSTSHFRTGEEDKKINEELESQYQQSMDSKLSGRYRRHCGLGFSEVEDHDGEGDVAGDDDDDDDDSPDPESPDDSESDSESEKEESAEELQAAEHPDEVEDPKNKKDAKSNYKMMFVKSSGS,20311.15170069,20323.35678,,RESID:51@0|RESID:37@15,,,1
3244,SMAP_HUMAN,O00193,Small acidic protein,O00193,,MSAARESHPHGVKRSASPDDDLGSSNWEAADLGNEERKQKFLRLMGAGKKEHTGRLVIGDHKSTSHFRTGEEDKKINEELESQYQQSMDSKLSGRYRRHCGLGFSEVEDHDGEGDVAGDDDDDDDDSPDPESPDDSESDSESEKEESAEELQAAEHPDEVEDPKNKKDAKSNYKMMFVKSSGS,1,182,182,SAARESHPHGVKRSASPDDDLGSSNWEAADLGNEERKQKFLRLMGAGKKEHTGRLVIGDHKSTSHFRTGEEDKKINEELESQYQQSMDSKLSGRYRRHCGLGFSEVEDHDGEGDVAGDDDDDDDDSPDPESPDDSESDSESEKEESAEELQAAEHPDEVEDPKNKKDAKSNYKMMFVKSSGS,20311.15170069,20323.35678,,RESID:51@0|RESID:37@23,,,1
3517,SMAP_HUMAN,O00193,Small acidic protein,O00193,,MSAARESHPHGVKRSASPDDDLGSSNWEAADLGNEERKQKFLRLMGAGKKEHTGRLVIGDHKSTSHFRTGEEDKKINEELESQYQQSMDSKLSGRYRRHCGLGFSEVEDHDGEGDVAGDDDDDDDDSPDPESPDDSESDSESEKEESAEELQAAEHPDEVEDPKNKKDAKSNYKMMFVKSSGS,1,182,182,SAARESHPHGVKRSASPDDDLGSSNWEAADLGNEERKQKFLRLMGAGKKEHTGRLVIGDHKSTSHFRTGEEDKKINEELESQYQQSMDSKLSGRYRRHCGLGFSEVEDHDGEGDVAGDDDDDDDDSPDPESPDDSESDSESEKEESAEELQAAEHPDEVEDPKNKKDAKSNYKMMFVKSSGS,20189.17480469,20201.33678,,,,,1
3620,SMAP_HUMAN,O00193,Small acidic protein,O00193,,MSAARESHPHGVKRSASPDDDLGSSNWEAADLGNEERKQKFLRLMGAGKKEHTGRLVIGDHKSTSHFRTGEEDKKINEELESQYQQSMDSKLSGRYRRHCGLGFSEVEDHDGEGDVAGDDDDDDDDSPDPESPDDSESDSESEKEESAEELQAAEHPDEVEDPKNKKDAKSNYKMMFVKSSGS,1,182,182,SAARESHPHGVKRSASPDDDLGSSNWEAADLGNEERKQKFLRLMGAGKKEHTGRLVIGDHKSTSHFRTGEEDKKINEELESQYQQSMDSKLSGRYRRHCGLGFSEVEDHDGEGDVAGDDDDDDDDSPDPESPDDSESDSESEKEESAEELQAAEHPDEVEDPKNKKDAKSNYKMMFVKSSGS,20391.11803169,20403.33678,,RESID:51@0|RESID:37@15|RESID:37@140,,,1
3717,SMAP_HUMAN,O00193,Small acidic protein,O00193,,MSAARESHPHGVKRSASPDDDLGSSNWEAADLGNEERKQKFLRLMGAGKKEHTGRLVIGDHKSTSHFRTGEEDKKINEELESQYQQSMDSKLSGRYRRHCGLGFSEVEDHDGEGDVAGDDDDDDDDSPDPESPDDSESDSESEKEESAEELQAAEHPDEVEDPKNKKDAKSNYKMMFVKSSGS,1,182,182,SAARESHPHGVKRSASPDDDLGSSNWEAADLGNEERKQKFLRLMGAGKKEHTGRLVIGDHKSTSHFRTGEEDKKINEELESQYQQSMDSKLSGRYRRHCGLGFSEVEDHDGEGDVAGDDDDDDDDSPDPESPDDSESDSESEKEESAEELQAAEHPDEVEDPKNKKDAKSNYKMMFVKSSGS,20311.15170069,20323.35678,,RESID:51@0|RESID:37@13,,,1
14396,SMAP_HUMAN,O00193,Small acidic protein,O00193,,MSAARESHPHGVKRSASPDDDLGSSNWEAADLGNEERKQKFLRLMGAGKKEHTGRLVIGDHKSTSHFRTGEEDKKINEELESQYQQSMDSKLSGRYRRHCGLGFSEVEDHDGEGDVAGDDDDDDDDSPDPESPDDSESDSESEKEESAEELQAAEHPDEVEDPKNKKDAKSNYKMMFVKSSGS,1,182,182,SAARESHPHGVKRSASPDDDLGSSNWEAADLGNEERKQKFLRLMGAGKKEHTGRLVIGDHKSTSHFRTGEEDKKINEELESQYQQSMDSKLSGRYRRHCGLGFSEVEDHDGEGDVAGDDDDDDDDSPDPESPDDSESDSESEKEESAEELQAAEHPDEVEDPKNKKDAKSNYKMMFVKSSGS,20551.05069369,20563.29678,,RESID:51@0|RESID:37@13|RESID:37@15|RESID:37@125|RESID:37@145,,,1
14397,SMAP_HUMAN,O00193,Small acidic protein,O00193,,MSAARESHPHGVKRSASPDDDLGSSNWEAADLGNEERKQKFLRLMGAGKKEHTGRLVIGDHKSTSHFRTGEEDKKINEELESQYQQSMDSKLSGRYRRHCGLGFSEVEDHDGEGDVAGDDDDDDDDSPDPESPDDSESDSESEKEESAEELQAAEHPDEVEDPKNKKDAKSNYKMMFVKSSGS,0,182,183,MSAARESHPHGVKRSASPDDDLGSSNWEAADLGNEERKQKFLRLMGAGKKEHTGRLVIGDHKSTSHFRTGEEDKKINEELESQYQQSMDSKLSGRYRRHCGLGFSEVEDHDGEGDVAGDDDDDDDDSPDPESPDDSESDSESEKEESAEELQAAEHPDEVEDPKNKKDAKSNYKMMFVKSSGS,20682.09118369,20694.48938,,RESID:49@0|RESID:37@14|RESID:37@16|RESID:37@126|RESID:37@146,,,1
