PFR,UniProt Id,Entry Accession,Entry Description,Isoform Accession,Isoform Description,Isoform Sequence,Start,End,Length,Proteoform Sequence,Monoisotopic Mass,Average Mass,Sequence Modifications,PTMs,N-Terminal,C-Terminal,Star
1420,ML12B_HUMAN,O14950,Myosin regulatory light chain 12B,O14950,,MSSKKAKTKTTKKRPQRATSNVFAMFDQSQIQEFKEAFNMIDQNRDGFIDKEDLHDMLASLGKNPTDAYLDAMMNEAPGPINFTMFLTMFGEKLNGTDPEDVIRNAFACFDEEATGTIQEDYLRELLTTMGDRFTDEEVDELYREAPIDKKGNFNYIEFTRILKHGAKDKDD,1,171,171,SSKKAKTKTTKKRPQRATSNVFAMFDQSQIQEFKEAFNMIDQNRDGFIDKEDLHDMLASLGKNPTDAYLDAMMNEAPGPINFTMFLTMFGEKLNGTDPEDVIRNAFACFDEEATGTIQEDYLRELLTTMGDRFTDEEVDELYREAPIDKKGNFNYIEFTRILKHGAKDKDD,19677.48570969,19690.00638,,RESID:51@0,,,1
7532,ML12B_HUMAN,O14950,Myosin regulatory light chain 12B,O14950,,MSSKKAKTKTTKKRPQRATSNVFAMFDQSQIQEFKEAFNMIDQNRDGFIDKEDLHDMLASLGKNPTDAYLDAMMNEAPGPINFTMFLTMFGEKLNGTDPEDVIRNAFACFDEEATGTIQEDYLRELLTTMGDRFTDEEVDELYREAPIDKKGNFNYIEFTRILKHGAKDKDD,1,171,171,SSKKAKTKTTKKRPQRATSNVFAMFDQSQIQEFKEAFNMIDQNRDGFIDKEDLHDMLASLGKNPTDAYLDAMMNEAPGPINFTMFLTMFGEKLNGTDPEDVIRNAFACFDEEATGTIQEDYLRELLTTMGDRFTDEEVDELYREAPIDKKGNFNYIEFTRILKHGAKDKDD,19757.45204069,19769.98638,,RESID:51@0|RESID:38@17,,,1
7659,ML12B_HUMAN,O14950,Myosin regulatory light chain 12B,O14950,,MSSKKAKTKTTKKRPQRATSNVFAMFDQSQIQEFKEAFNMIDQNRDGFIDKEDLHDMLASLGKNPTDAYLDAMMNEAPGPINFTMFLTMFGEKLNGTDPEDVIRNAFACFDEEATGTIQEDYLRELLTTMGDRFTDEEVDELYREAPIDKKGNFNYIEFTRILKHGAKDKDD,1,171,171,SSKKAKTKTTKKRPQRATSNVFAMFDQSQIQEFKEAFNMIDQNRDGFIDKEDLHDMLASLGKNPTDAYLDAMMNEAPGPINFTMFLTMFGEKLNGTDPEDVIRNAFACFDEEATGTIQEDYLRELLTTMGDRFTDEEVDELYREAPIDKKGNFNYIEFTRILKHGAKDKDD,19837.41837169,19849.96638,,RESID:51@0|RESID:38@17|RESID:37@18,,,1
14268,ML12B_HUMAN,O14950,Myosin regulatory light chain 12B,O14950,,MSSKKAKTKTTKKRPQRATSNVFAMFDQSQIQEFKEAFNMIDQNRDGFIDKEDLHDMLASLGKNPTDAYLDAMMNEAPGPINFTMFLTMFGEKLNGTDPEDVIRNAFACFDEEATGTIQEDYLRELLTTMGDRFTDEEVDELYREAPIDKKGNFNYIEFTRILKHGAKDKDD,0,171,172,MSSKKAKTKTTKKRPQRATSNVFAMFDQSQIQEFKEAFNMIDQNRDGFIDKEDLHDMLASLGKNPTDAYLDAMMNEAPGPINFTMFLTMFGEKLNGTDPEDVIRNAFACFDEEATGTIQEDYLRELLTTMGDRFTDEEVDELYREAPIDKKGNFNYIEFTRILKHGAKDKDD,19968.45886169,19981.15898,,RESID:49@0|RESID:38@18|RESID:37@19,,,1
15888,ML12B_HUMAN,O14950,Myosin regulatory light chain 12B,O14950,,MSSKKAKTKTTKKRPQRATSNVFAMFDQSQIQEFKEAFNMIDQNRDGFIDKEDLHDMLASLGKNPTDAYLDAMMNEAPGPINFTMFLTMFGEKLNGTDPEDVIRNAFACFDEEATGTIQEDYLRELLTTMGDRFTDEEVDELYREAPIDKKGNFNYIEFTRILKHGAKDKDD,1,171,171,SSKKAKTKTTKKRPQRATSNVFAMFDQSQIQEFKEAFNMIDQNRDGFIDKEDLHDMLASLGKNPTDAYLDAMMNEAPGPINFTMFLTMFGEKLNGTDPEDVIRNAFACFDEEATGTIQEDYLRELLTTMGDRFTDEEVDELYREAPIDKKGNFNYIEFTRILKHGAKDKDD,19677.48571,19690.00638,,,PSI-MOD:1458,,0
15946,ML12B_HUMAN,O14950,Myosin regulatory light chain 12B,O14950,,MSSKKAKTKTTKKRPQRATSNVFAMFDQSQIQEFKEAFNMIDQNRDGFIDKEDLHDMLASLGKNPTDAYLDAMMNEAPGPINFTMFLTMFGEKLNGTDPEDVIRNAFACFDEEATGTIQEDYLRELLTTMGDRFTDEEVDELYREAPIDKKGNFNYIEFTRILKHGAKDKDD,1,171,171,SSKKAKTKTTKKRPQRATSNVFAMFDQSQIQEFKEAFNMIDQNRDGFIDKEDLHDMLASLGKNPTDAYLDAMMNEAPGPINFTMFLTMFGEKLNGTDPEDVIRNAFACFDEEATGTIQEDYLRELLTTMGDRFTDEEVDELYREAPIDKKGNFNYIEFTRILKHGAKDKDD,19635.47514,19647.96638,,,,,0
16768,ML12B_HUMAN,O14950,Myosin regulatory light chain 12B,O14950,,MSSKKAKTKTTKKRPQRATSNVFAMFDQSQIQEFKEAFNMIDQNRDGFIDKEDLHDMLASLGKNPTDAYLDAMMNEAPGPINFTMFLTMFGEKLNGTDPEDVIRNAFACFDEEATGTIQEDYLRELLTTMGDRFTDEEVDELYREAPIDKKGNFNYIEFTRILKHGAKDKDD,0,171,172,MSSKKAKTKTTKKRPQRATSNVFAMFDQSQIQEFKEAFNMIDQNRDGFIDKEDLHDMLASLGKNPTDAYLDAMMNEAPGPINFTMFLTMFGEKLNGTDPEDVIRNAFACFDEEATGTIQEDYLRELLTTMGDRFTDEEVDGLYREAPIDKKGNFNYIEFTRILKHGAKDKDD,19694.4945,19707.09538,PSI-MOD:17@140,,,,0
17255,ML12B_HUMAN,O14950,Myosin regulatory light chain 12B,O14950,,MSSKKAKTKTTKKRPQRATSNVFAMFDQSQIQEFKEAFNMIDQNRDGFIDKEDLHDMLASLGKNPTDAYLDAMMNEAPGPINFTMFLTMFGEKLNGTDPEDVIRNAFACFDEEATGTIQEDYLRELLTTMGDRFTDEEVDELYREAPIDKKGNFNYIEFTRILKHGAKDKDD,1,171,171,SSKKAKTKTTKKRPQRATSNVFAMFDQSQIQEFKEAFNMIDQNRDGFIDKEDLHDMLASLGKNPTDAYLDAMMNEAPGPINFTMFLTMFGEKLNGTDPEDVIRNAFACFDEEATGTIQEDYLRELLTTMGDRFTDEEVDGLYREAPIDKKGNFNYIEFTRILKHGAKDKDD,19723.38668,19735.86278,PSI-MOD:17@140,RESID:38@17|RESID:37@18,,,0
17381,ML12B_HUMAN,O14950,Myosin regulatory light chain 12B,O14950,,MSSKKAKTKTTKKRPQRATSNVFAMFDQSQIQEFKEAFNMIDQNRDGFIDKEDLHDMLASLGKNPTDAYLDAMMNEAPGPINFTMFLTMFGEKLNGTDPEDVIRNAFACFDEEATGTIQEDYLRELLTTMGDRFTDEEVDELYREAPIDKKGNFNYIEFTRILKHGAKDKDD,0,171,172,MSSKKAKTKTTKKRPQRATSNVFAMFDQSQIQEFKEAFNMIDQNRDGFIDKEDLHDMLASLGKNPTDAYLDAMMNEAPGPINFTMFLTMFGEKLNGTDPEDVIRNAFACFDEEATGTIQEDYLRELLTTMGDRFTDEEVDELYREAPIDKKGNFNYIEFTRILKHGAKDKDD,19808.5262,19821.19898,,,PSI-MOD:1458,,0
17643,ML12B_HUMAN,O14950,Myosin regulatory light chain 12B,O14950,,MSSKKAKTKTTKKRPQRATSNVFAMFDQSQIQEFKEAFNMIDQNRDGFIDKEDLHDMLASLGKNPTDAYLDAMMNEAPGPINFTMFLTMFGEKLNGTDPEDVIRNAFACFDEEATGTIQEDYLRELLTTMGDRFTDEEVDELYREAPIDKKGNFNYIEFTRILKHGAKDKDD,1,171,171,SSKKAKTKTTKKRPQRATSNVFAMFDQSQIQEFKEAFNMIDQNRDGFIDKEDLHDMLASLGKNPTDAYLDAMMNEAPGPINFTMFLTMFGEKLNGTDPEDVIRNAFACFDEEATGTIQEDYLRELLTTMGDRFTDEEVDELYREAPIDKKGNFNYIEFTRILKHGAKDKDD,19795.40781,19807.92638,,RESID:38@17|RESID:37@18,,,0
