PFR,UniProt Id,Entry Accession,Entry Description,Isoform Accession,Isoform Description,Isoform Sequence,Start,End,Length,Proteoform Sequence,Monoisotopic Mass,Average Mass,Sequence Modifications,PTMs,N-Terminal,C-Terminal,Star
10826,G3P2_YEAST,P00358,Glyceraldehyde-3-phosphate dehydrogenase 2,P00358,,MVRVAINGFGRIGRLVMRIALQRKNVEVVALNDPFISNDYSAYMFKYDSTHGRYAGEVSHDDKHIIVDGHKIATFQERDPANLPWASLNIDIAIDSTGVFKELDTAQKHIDAGAKKVVITAPSSTAPMFVMGVNEEKYTSDLKIVSNASCTTNCLAPLAKVINDAFGIEEGLMTTVHSMTATQKTVDGPSHKDWRGGRTASGNIIPSSTGAAKAVGKVLPELQGKLTGMAFRVPTVDVSVVDLTVKLNKETTYDEIKKVVKAAAEGKLKGVLGYTEDAVVSSDFLGDSNSSIFDAAAGIQLSPKFVKLVSWYDNEYGYSTRVVDLVEHVAKA,0,331,332,MVRVAINGFGRIGRLVMRIALQRKNVEVVALNDPFISNDYSAYMFKYDSTHGRYAGEVSHDDKHIIVDGHKIATFQERDPANLPWASLNIDIAIDSTGVFKELDTAQKHIDAGAKKVVITAPSSTAPMFVMGVNEEKYTSDLKIVSNASCTTNCLAPLAKVINDAFGIEEGLMTTVHSMTATQKTVDGPSHKDWRGGRTASGNIIPSSTGAAKAVGKVLPELQGKLTGMAFRVPTVDVSVVDLTVKLNKETTYDEIKKVVKAAAEGKLKGVLGYTEDAVVSSDFLGDSNSSIFDAAAGIQLSPKFVKLVSWYDNEYGYSTRVVDLVEHVAKA,35866.42562969,35888.89298,,PSI-MOD:394@0,,,1
10931,G3P2_YEAST,P00358,Glyceraldehyde-3-phosphate dehydrogenase 2,P00358,,MVRVAINGFGRIGRLVMRIALQRKNVEVVALNDPFISNDYSAYMFKYDSTHGRYAGEVSHDDKHIIVDGHKIATFQERDPANLPWASLNIDIAIDSTGVFKELDTAQKHIDAGAKKVVITAPSSTAPMFVMGVNEEKYTSDLKIVSNASCTTNCLAPLAKVINDAFGIEEGLMTTVHSMTATQKTVDGPSHKDWRGGRTASGNIIPSSTGAAKAVGKVLPELQGKLTGMAFRVPTVDVSVVDLTVKLNKETTYDEIKKVVKAAAEGKLKGVLGYTEDAVVSSDFLGDSNSSIFDAAAGIQLSPKFVKLVSWYDNEYGYSTRVVDLVEHVAKA,1,331,331,VRVAINGFGRIGRLVMRIALQRKNVEVVALNDPFISNDYSAYMFKYDSTHGRYAGEVSHDDKHIIVDGHKIATFQERDPANLPWASLNIDIAIDSTGVFKELDTAQKHIDAGAKKVVITAPSSTAPMFVMGVNEEKYTSDLKIVSNASCTTNCLAPLAKVINDAFGIEEGLMTTVHSMTATQKTVDGPSHKDWRGGRTASGNIIPSSTGAAKAVGKVLPELQGKLTGMAFRVPTVDVSVVDLTVKLNKETTYDEIKKVVKAAAEGKLKGVLGYTEDAVVSSDFLGDSNSSIFDAAAGIQLSPKFVKLVSWYDNEYGYSTRVVDLVEHVAKA,35735.38513969,35757.70038,,PSI-MOD:394@0,,,1
11061,G3P2_YEAST,P00358,Glyceraldehyde-3-phosphate dehydrogenase 2,P00358,,MVRVAINGFGRIGRLVMRIALQRKNVEVVALNDPFISNDYSAYMFKYDSTHGRYAGEVSHDDKHIIVDGHKIATFQERDPANLPWASLNIDIAIDSTGVFKELDTAQKHIDAGAKKVVITAPSSTAPMFVMGVNEEKYTSDLKIVSNASCTTNCLAPLAKVINDAFGIEEGLMTTVHSMTATQKTVDGPSHKDWRGGRTASGNIIPSSTGAAKAVGKVLPELQGKLTGMAFRVPTVDVSVVDLTVKLNKETTYDEIKKVVKAAAEGKLKGVLGYTEDAVVSSDFLGDSNSSIFDAAAGIQLSPKFVKLVSWYDNEYGYSTRVVDLVEHVAKA,293,331,39,DAAAGIQLSPKFVKLVSWYDNEYGYSTRVVDLVEHVAKA,4338.23238469,4340.90268,,,,,1
11071,G3P2_YEAST,P00358,Glyceraldehyde-3-phosphate dehydrogenase 2,P00358,,MVRVAINGFGRIGRLVMRIALQRKNVEVVALNDPFISNDYSAYMFKYDSTHGRYAGEVSHDDKHIIVDGHKIATFQERDPANLPWASLNIDIAIDSTGVFKELDTAQKHIDAGAKKVVITAPSSTAPMFVMGVNEEKYTSDLKIVSNASCTTNCLAPLAKVINDAFGIEEGLMTTVHSMTATQKTVDGPSHKDWRGGRTASGNIIPSSTGAAKAVGKVLPELQGKLTGMAFRVPTVDVSVVDLTVKLNKETTYDEIKKVVKAAAEGKLKGVLGYTEDAVVSSDFLGDSNSSIFDAAAGIQLSPKFVKLVSWYDNEYGYSTRVVDLVEHVAKA,282,331,50,DFLGDSNSSIFDAAAGIQLSPKFVKLVSWYDNEYGYSTRVVDLVEHVAKA,5520.75168469,5524.14218,,,,,1
11414,G3P2_YEAST,P00358,Glyceraldehyde-3-phosphate dehydrogenase 2,P00358,,MVRVAINGFGRIGRLVMRIALQRKNVEVVALNDPFISNDYSAYMFKYDSTHGRYAGEVSHDDKHIIVDGHKIATFQERDPANLPWASLNIDIAIDSTGVFKELDTAQKHIDAGAKKVVITAPSSTAPMFVMGVNEEKYTSDLKIVSNASCTTNCLAPLAKVINDAFGIEEGLMTTVHSMTATQKTVDGPSHKDWRGGRTASGNIIPSSTGAAKAVGKVLPELQGKLTGMAFRVPTVDVSVVDLTVKLNKETTYDEIKKVVKAAAEGKLKGVLGYTEDAVVSSDFLGDSNSSIFDAAAGIQLSPKFVKLVSWYDNEYGYSTRVVDLVEHVAKA,0,331,332,MVRVAINGFGRIGRLVMRIALQRKNVEVVALNDPFISNDYSAYMFKYDSTHGRYAGEVSHDDKHIIVDGHKIATFQERDPANLPWASLNIDIAIDSTGVFKELDTAQKHIDAGAKKVVITAPSSTAPMFVMGVNEEKYTSDLKIVSNASCTTNCLAPLAKVINDAFGIEEGLMTTVHSMTATQKTVDGPSHKDWRGGRTASGNIIPSSTGAAKAVGKVLPELQGKLTGMAFRVPTVDVSVVDLTVKLNKETTYDEIKKVVKAAAEGKLKGVLGYTEDAVVSSDFLGDSNSSIFDAAAGIQLSPKFVKLVSWYDNEYGYSTRVVDLVEHVAKA,35824.41506469,35846.85298,,,,,1
11511,G3P2_YEAST,P00358,Glyceraldehyde-3-phosphate dehydrogenase 2,P00358,,MVRVAINGFGRIGRLVMRIALQRKNVEVVALNDPFISNDYSAYMFKYDSTHGRYAGEVSHDDKHIIVDGHKIATFQERDPANLPWASLNIDIAIDSTGVFKELDTAQKHIDAGAKKVVITAPSSTAPMFVMGVNEEKYTSDLKIVSNASCTTNCLAPLAKVINDAFGIEEGLMTTVHSMTATQKTVDGPSHKDWRGGRTASGNIIPSSTGAAKAVGKVLPELQGKLTGMAFRVPTVDVSVVDLTVKLNKETTYDEIKKVVKAAAEGKLKGVLGYTEDAVVSSDFLGDSNSSIFDAAAGIQLSPKFVKLVSWYDNEYGYSTRVVDLVEHVAKA,182,331,150,QKTVDGPSHKDWRGGRTASGNIIPSSTGAAKAVGKVLPELQGKLTGMAFRVPTVDVSVVDLTVKLNKETTYDEIKKVVKAAAEGKLKGVLGYTEDAVVSSDFLGDSNSSIFDAAAGIQLSPKFVKLVSWYDNEYGYSTRVVDLVEHVAKA,15964.37868469,15974.13808,,,,,1
11615,G3P2_YEAST,P00358,Glyceraldehyde-3-phosphate dehydrogenase 2,P00358,,MVRVAINGFGRIGRLVMRIALQRKNVEVVALNDPFISNDYSAYMFKYDSTHGRYAGEVSHDDKHIIVDGHKIATFQERDPANLPWASLNIDIAIDSTGVFKELDTAQKHIDAGAKKVVITAPSSTAPMFVMGVNEEKYTSDLKIVSNASCTTNCLAPLAKVINDAFGIEEGLMTTVHSMTATQKTVDGPSHKDWRGGRTASGNIIPSSTGAAKAVGKVLPELQGKLTGMAFRVPTVDVSVVDLTVKLNKETTYDEIKKVVKAAAEGKLKGVLGYTEDAVVSSDFLGDSNSSIFDAAAGIQLSPKFVKLVSWYDNEYGYSTRVVDLVEHVAKA,207,331,125,STGAAKAVGKVLPELQGKLTGMAFRVPTVDVSVVDLTVKLNKETTYDEIKKVVKAAAEGKLKGVLGYTEDAVVSSDFLGDSNSSIFDAAAGIQLSPKFVKLVSWYDNEYGYSTRVVDLVEHVAKA,13319.03648469,13327.23288,,,,,1
11622,G3P2_YEAST,P00358,Glyceraldehyde-3-phosphate dehydrogenase 2,P00358,,MVRVAINGFGRIGRLVMRIALQRKNVEVVALNDPFISNDYSAYMFKYDSTHGRYAGEVSHDDKHIIVDGHKIATFQERDPANLPWASLNIDIAIDSTGVFKELDTAQKHIDAGAKKVVITAPSSTAPMFVMGVNEEKYTSDLKIVSNASCTTNCLAPLAKVINDAFGIEEGLMTTVHSMTATQKTVDGPSHKDWRGGRTASGNIIPSSTGAAKAVGKVLPELQGKLTGMAFRVPTVDVSVVDLTVKLNKETTYDEIKKVVKAAAEGKLKGVLGYTEDAVVSSDFLGDSNSSIFDAAAGIQLSPKFVKLVSWYDNEYGYSTRVVDLVEHVAKA,238,331,94,SVVDLTVKLNKETTYDEIKKVVKAAAEGKLKGVLGYTEDAVVSSDFLGDSNSSIFDAAAGIQLSPKFVKLVSWYDNEYGYSTRVVDLVEHVAKA,10197.30438469,10203.52818,,,,,1
11674,G3P2_YEAST,P00358,Glyceraldehyde-3-phosphate dehydrogenase 2,P00358,,MVRVAINGFGRIGRLVMRIALQRKNVEVVALNDPFISNDYSAYMFKYDSTHGRYAGEVSHDDKHIIVDGHKIATFQERDPANLPWASLNIDIAIDSTGVFKELDTAQKHIDAGAKKVVITAPSSTAPMFVMGVNEEKYTSDLKIVSNASCTTNCLAPLAKVINDAFGIEEGLMTTVHSMTATQKTVDGPSHKDWRGGRTASGNIIPSSTGAAKAVGKVLPELQGKLTGMAFRVPTVDVSVVDLTVKLNKETTYDEIKKVVKAAAEGKLKGVLGYTEDAVVSSDFLGDSNSSIFDAAAGIQLSPKFVKLVSWYDNEYGYSTRVVDLVEHVAKA,184,331,148,TVDGPSHKDWRGGRTASGNIIPSSTGAAKAVGKVLPELQGKLTGMAFRVPTVDVSVVDLTVKLNKETTYDEIKKVVKAAAEGKLKGVLGYTEDAVVSSDFLGDSNSSIFDAAAGIQLSPKFVKLVSWYDNEYGYSTRVVDLVEHVAKA,15708.22514469,15717.83328,,,,,1
11727,G3P2_YEAST,P00358,Glyceraldehyde-3-phosphate dehydrogenase 2,P00358,,MVRVAINGFGRIGRLVMRIALQRKNVEVVALNDPFISNDYSAYMFKYDSTHGRYAGEVSHDDKHIIVDGHKIATFQERDPANLPWASLNIDIAIDSTGVFKELDTAQKHIDAGAKKVVITAPSSTAPMFVMGVNEEKYTSDLKIVSNASCTTNCLAPLAKVINDAFGIEEGLMTTVHSMTATQKTVDGPSHKDWRGGRTASGNIIPSSTGAAKAVGKVLPELQGKLTGMAFRVPTVDVSVVDLTVKLNKETTYDEIKKVVKAAAEGKLKGVLGYTEDAVVSSDFLGDSNSSIFDAAAGIQLSPKFVKLVSWYDNEYGYSTRVVDLVEHVAKA,1,130,130,VRVAINGFGRIGRLVMRIALQRKNVEVVALNDPFISNDYSAYMFKYDSTHGRYAGEVSHDDKHIIVDGHKIATFQERDPANLPWASLNIDIAIDSTGVFKELDTAQKHIDAGAKKVVITAPSSTAPMFVM,14378.40897469,14387.44328,,,,,1
11728,G3P2_YEAST,P00358,Glyceraldehyde-3-phosphate dehydrogenase 2,P00358,,MVRVAINGFGRIGRLVMRIALQRKNVEVVALNDPFISNDYSAYMFKYDSTHGRYAGEVSHDDKHIIVDGHKIATFQERDPANLPWASLNIDIAIDSTGVFKELDTAQKHIDAGAKKVVITAPSSTAPMFVMGVNEEKYTSDLKIVSNASCTTNCLAPLAKVINDAFGIEEGLMTTVHSMTATQKTVDGPSHKDWRGGRTASGNIIPSSTGAAKAVGKVLPELQGKLTGMAFRVPTVDVSVVDLTVKLNKETTYDEIKKVVKAAAEGKLKGVLGYTEDAVVSSDFLGDSNSSIFDAAAGIQLSPKFVKLVSWYDNEYGYSTRVVDLVEHVAKA,1,144,144,VRVAINGFGRIGRLVMRIALQRKNVEVVALNDPFISNDYSAYMFKYDSTHGRYAGEVSHDDKHIIVDGHKIATFQERDPANLPWASLNIDIAIDSTGVFKELDTAQKHIDAGAKKVVITAPSSTAPMFVMGVNEEKYTSDLKIV,15954.22338469,15964.21008,,,,,1
11729,G3P2_YEAST,P00358,Glyceraldehyde-3-phosphate dehydrogenase 2,P00358,,MVRVAINGFGRIGRLVMRIALQRKNVEVVALNDPFISNDYSAYMFKYDSTHGRYAGEVSHDDKHIIVDGHKIATFQERDPANLPWASLNIDIAIDSTGVFKELDTAQKHIDAGAKKVVITAPSSTAPMFVMGVNEEKYTSDLKIVSNASCTTNCLAPLAKVINDAFGIEEGLMTTVHSMTATQKTVDGPSHKDWRGGRTASGNIIPSSTGAAKAVGKVLPELQGKLTGMAFRVPTVDVSVVDLTVKLNKETTYDEIKKVVKAAAEGKLKGVLGYTEDAVVSSDFLGDSNSSIFDAAAGIQLSPKFVKLVSWYDNEYGYSTRVVDLVEHVAKA,1,331,331,VRVAINGFGRIGRLVMRIALQRKNVEVVALNDPFISNDYSAYMFKYDSTHGRYAGEVSHDDKHIIVDGHKIATFQERDPANLPWASLNIDIAIDSTGVFKELDTAQKHIDAGAKKVVITAPSSTAPMFVMGVNEEKYTSDLKIVSNASCTTNCLAPLAKVINDAFGIEEGLMTTVHSMTATQKTVDGPSHKDWRGGRTASGNIIPSSTGAAKAVGKVLPELQGKLTGMAFRVPTVDVSVVDLTVKLNKETTYDEIKKVVKAAAEGKLKGVLGYTEDAVVSSDFLGDSNSSIFDAAAGIQLSPKFVKLVSWYDNEYGYSTRVVDLVEHVAKA,35693.37457469,35715.66038,,,,,1
11772,G3P2_YEAST,P00358,Glyceraldehyde-3-phosphate dehydrogenase 2,P00358,,MVRVAINGFGRIGRLVMRIALQRKNVEVVALNDPFISNDYSAYMFKYDSTHGRYAGEVSHDDKHIIVDGHKIATFQERDPANLPWASLNIDIAIDSTGVFKELDTAQKHIDAGAKKVVITAPSSTAPMFVMGVNEEKYTSDLKIVSNASCTTNCLAPLAKVINDAFGIEEGLMTTVHSMTATQKTVDGPSHKDWRGGRTASGNIIPSSTGAAKAVGKVLPELQGKLTGMAFRVPTVDVSVVDLTVKLNKETTYDEIKKVVKAAAEGKLKGVLGYTEDAVVSSDFLGDSNSSIFDAAAGIQLSPKFVKLVSWYDNEYGYSTRVVDLVEHVAKA,239,331,93,VVDLTVKLNKETTYDEIKKVVKAAAEGKLKGVLGYTEDAVVSSDFLGDSNSSIFDAAAGIQLSPKFVKLVSWYDNEYGYSTRVVDLVEHVAKA,10110.27235469,10116.44998,,,,,1
11882,G3P2_YEAST,P00358,Glyceraldehyde-3-phosphate dehydrogenase 2,P00358,,MVRVAINGFGRIGRLVMRIALQRKNVEVVALNDPFISNDYSAYMFKYDSTHGRYAGEVSHDDKHIIVDGHKIATFQERDPANLPWASLNIDIAIDSTGVFKELDTAQKHIDAGAKKVVITAPSSTAPMFVMGVNEEKYTSDLKIVSNASCTTNCLAPLAKVINDAFGIEEGLMTTVHSMTATQKTVDGPSHKDWRGGRTASGNIIPSSTGAAKAVGKVLPELQGKLTGMAFRVPTVDVSVVDLTVKLNKETTYDEIKKVVKAAAEGKLKGVLGYTEDAVVSSDFLGDSNSSIFDAAAGIQLSPKFVKLVSWYDNEYGYSTRVVDLVEHVAKA,1,129,129,VRVAINGFGRIGRLVMRIALQRKNVEVVALNDPFISNDYSAYMFKYDSTHGRYAGEVSHDDKHIIVDGHKIATFQERDPANLPWASLNIDIAIDSTGVFKELDTAQKHIDAGAKKVVITAPSSTAPMFV,14289.37904969,14298.29068,,PSI-MOD:394@0,,,0
11883,G3P2_YEAST,P00358,Glyceraldehyde-3-phosphate dehydrogenase 2,P00358,,MVRVAINGFGRIGRLVMRIALQRKNVEVVALNDPFISNDYSAYMFKYDSTHGRYAGEVSHDDKHIIVDGHKIATFQERDPANLPWASLNIDIAIDSTGVFKELDTAQKHIDAGAKKVVITAPSSTAPMFVMGVNEEKYTSDLKIVSNASCTTNCLAPLAKVINDAFGIEEGLMTTVHSMTATQKTVDGPSHKDWRGGRTASGNIIPSSTGAAKAVGKVLPELQGKLTGMAFRVPTVDVSVVDLTVKLNKETTYDEIKKVVKAAAEGKLKGVLGYTEDAVVSSDFLGDSNSSIFDAAAGIQLSPKFVKLVSWYDNEYGYSTRVVDLVEHVAKA,1,130,130,VRVAINGFGRIGRLVMRIALQRKNVEVVALNDPFISNDYSAYMFKYDSTHGRYAGEVSHDDKHIIVDGHKIATFQERDPANLPWASLNIDIAIDSTGVFKELDTAQKHIDAGAKKVVITAPSSTAPMFVM,14420.41953969,14429.48328,,PSI-MOD:394@0,,,0
