PFR,UniProt Id,Entry Accession,Entry Description,Isoform Accession,Isoform Description,Isoform Sequence,Start,End,Length,Proteoform Sequence,Monoisotopic Mass,Average Mass,Sequence Modifications,PTMs,N-Terminal,C-Terminal,Star
18628,PLF4_HUMAN,P02776,Platelet factor 4,P02776,,MSSAAGFCASRPGLLFLGLLLLPLVVAFASAEAEEDGDLQCLCVKTTSQVRPRHITSLEVIKAGPHCPTAQLIATLKNGRKICLDLQAPLYKKIIKKLLES,31,100,70,EAEEDGDLQCLCVKTTSQVRPRHITSLEVIKAGPHCPTAQLIATLKNGRKICLDLQAPLYKKIIKKLLES,7764.208155,7769.17868,,,,,0
18629,PLF4_HUMAN,P02776,Platelet factor 4,P02776,,MSSAAGFCASRPGLLFLGLLLLPLVVAFASAEAEEDGDLQCLCVKTTSQVRPRHITSLEVIKAGPHCPTAQLIATLKNGRKICLDLQAPLYKKIIKKLLES,44,100,57,KTTSQVRPRHITSLEVIKAGPHCPTAQLIATLKNGRKICLDLQAPLYKKIIKKLLES,6359.654445,6363.66458,,,,,0
18631,PLF4_HUMAN,P02776,Platelet factor 4,P02776,,MSSAAGFCASRPGLLFLGLLLLPLVVAFASAEAEEDGDLQCLCVKTTSQVRPRHITSLEVIKAGPHCPTAQLIATLKNGRKICLDLQAPLYKKIIKKLLES,27,100,74,FASAEAEEDGDLQCLCVKTTSQVRPRHITSLEVIKAGPHCPTAQLIATLKNGRKICLDLQAPLYKKIIKKLLES,8140.382815,8145.59108,,,,,0
18632,PLF4_HUMAN,P02776,Platelet factor 4,P02776,,MSSAAGFCASRPGLLFLGLLLLPLVVAFASAEAEEDGDLQCLCVKTTSQVRPRHITSLEVIKAGPHCPTAQLIATLKNGRKICLDLQAPLYKKIIKKLLES,73,100,28,ATLKNGRKICLDLQAPLYKKIIKKLLES,3196.909685,3198.94488,,,,,0
18633,PLF4_HUMAN,P02776,Platelet factor 4,P02776,,MSSAAGFCASRPGLLFLGLLLLPLVVAFASAEAEEDGDLQCLCVKTTSQVRPRHITSLEVIKAGPHCPTAQLIATLKNGRKICLDLQAPLYKKIIKKLLES,30,100,71,AEAEEDGDLQCLCVKTTSQVRPRHITSLEVIKAGPHCPTAQLIATLKNGRKICLDLQAPLYKKIIKKLLES,7835.245265,7840.25748,,,,,0
18634,PLF4_HUMAN,P02776,Platelet factor 4,P02776,,MSSAAGFCASRPGLLFLGLLLLPLVVAFASAEAEEDGDLQCLCVKTTSQVRPRHITSLEVIKAGPHCPTAQLIATLKNGRKICLDLQAPLYKKIIKKLLES,29,100,72,SAEAEEDGDLQCLCVKTTSQVRPRHITSLEVIKAGPHCPTAQLIATLKNGRKICLDLQAPLYKKIIKKLLES,7922.277295,7927.33568,,,,,0
18635,PLF4_HUMAN,P02776,Platelet factor 4,P02776,,MSSAAGFCASRPGLLFLGLLLLPLVVAFASAEAEEDGDLQCLCVKTTSQVRPRHITSLEVIKAGPHCPTAQLIATLKNGRKICLDLQAPLYKKIIKKLLES,0,100,101,MSSAAGFCASRPGLLFLGLLLLPLVVAFASAEAEEDGDLQCLCVKTTSQVRPRHITSLEVIKAGPHCPTAQLIATLKNGRKICLDLQAPLYKKIIKKLLES,10837.89415,10844.94248,,,,,0
18637,PLF4_HUMAN,P02776,Platelet factor 4,P02776,,MSSAAGFCASRPGLLFLGLLLLPLVVAFASAEAEEDGDLQCLCVKTTSQVRPRHITSLEVIKAGPHCPTAQLIATLKNGRKICLDLQAPLYKKIIKKLLES,33,100,68,EEDGDLQCLCVKTTSQVRPRHITSLEVIKAGPHCPTAQLIATLKNGRKICLDLQAPLYKKIIKKLLES,7564.128455,7568.98438,,,,,0
18638,PLF4_HUMAN,P02776,Platelet factor 4,P02776,,MSSAAGFCASRPGLLFLGLLLLPLVVAFASAEAEEDGDLQCLCVKTTSQVRPRHITSLEVIKAGPHCPTAQLIATLKNGRKICLDLQAPLYKKIIKKLLES,1,100,100,SSAAGFCASRPGLLFLGLLLLPLVVAFASAEAEEDGDLQCLCVKTTSQVRPRHITSLEVIKAGPHCPTAQLIATLKNGRKICLDLQAPLYKKIIKKLLES,10706.85366,10713.74988,,,,,0
18639,PLF4_HUMAN,P02776,Platelet factor 4,P02776,,MSSAAGFCASRPGLLFLGLLLLPLVVAFASAEAEEDGDLQCLCVKTTSQVRPRHITSLEVIKAGPHCPTAQLIATLKNGRKICLDLQAPLYKKIIKKLLES,31,100,70,EAEEDGDLQCLCVKTTSQVRPRHITSLEVIKAGPHCPTAQLIATLKNGRKICLDLQAPLYKKIIKKLLES,7806.21872,7811.21868,,,PSI-MOD:1458,,0
18640,PLF4_HUMAN,P02776,Platelet factor 4,P02776,,MSSAAGFCASRPGLLFLGLLLLPLVVAFASAEAEEDGDLQCLCVKTTSQVRPRHITSLEVIKAGPHCPTAQLIATLKNGRKICLDLQAPLYKKIIKKLLES,35,100,66,DGDLQCLCVKTTSQVRPRHITSLEVIKAGPHCPTAQLIATLKNGRKICLDLQAPLYKKIIKKLLES,7306.043275,7310.75338,,,,,0
18641,PLF4_HUMAN,P02776,Platelet factor 4,P02776,,MSSAAGFCASRPGLLFLGLLLLPLVVAFASAEAEEDGDLQCLCVKTTSQVRPRHITSLEVIKAGPHCPTAQLIATLKNGRKICLDLQAPLYKKIIKKLLES,32,100,69,AEEDGDLQCLCVKTTSQVRPRHITSLEVIKAGPHCPTAQLIATLKNGRKICLDLQAPLYKKIIKKLLES,7635.165565,7640.06318,,,,,0
18642,PLF4_HUMAN,P02776,Platelet factor 4,P02776,,MSSAAGFCASRPGLLFLGLLLLPLVVAFASAEAEEDGDLQCLCVKTTSQVRPRHITSLEVIKAGPHCPTAQLIATLKNGRKICLDLQAPLYKKIIKKLLES,34,100,67,EDGDLQCLCVKTTSQVRPRHITSLEVIKAGPHCPTAQLIATLKNGRKICLDLQAPLYKKIIKKLLES,7435.085865,7439.86888,,,,,0
18643,PLF4_HUMAN,P02776,Platelet factor 4,P02776,,MSSAAGFCASRPGLLFLGLLLLPLVVAFASAEAEEDGDLQCLCVKTTSQVRPRHITSLEVIKAGPHCPTAQLIATLKNGRKICLDLQAPLYKKIIKKLLES,67,100,34,PTAQLIATLKNGRKICLDLQAPLYKKIIKKLLES,3820.273935,3822.69498,,,,,0
18644,PLF4_HUMAN,P02776,Platelet factor 4,P02776,,MSSAAGFCASRPGLLFLGLLLLPLVVAFASAEAEEDGDLQCLCVKTTSQVRPRHITSLEVIKAGPHCPTAQLIATLKNGRKICLDLQAPLYKKIIKKLLES,36,100,65,GDLQCLCVKTTSQVRPRHITSLEVIKAGPHCPTAQLIATLKNGRKICLDLQAPLYKKIIKKLLES,7191.016335,7195.66478,,,,,0
69076,PLF4_HUMAN,P02776,Platelet factor 4,P02776,,MSSAAGFCASRPGLLFLGLLLLPLVVAFASAEAEEDGDLQCLCVKTTSQVRPRHITSLEVIKAGPHCPTAQLIATLKNGRKICLDLQAPLYKKIIKKLLES,31,100,70,EAEEDGDLQCLCVKTTSQVRPRHITSLEVIKAGPHCPTAQLIATLKNGRKICLDLQAPLYKKIIKKLLES,7844.17448569,7849.15868,,RESID:37@25,,,1
69077,PLF4_HUMAN,P02776,Platelet factor 4,P02776,,MSSAAGFCASRPGLLFLGLLLLPLVVAFASAEAEEDGDLQCLCVKTTSQVRPRHITSLEVIKAGPHCPTAQLIATLKNGRKICLDLQAPLYKKIIKKLLES,31,100,70,EAEEDGDLQCLCVKTTSQVRPRHITSLEVIKAGPHCPTAQLIATLKNGRKICLDLQAPLYKKIIKKLLES,7886.18505069,7891.19868,,RESID:37@25,PSI-MOD:1458,,1
73290,PLF4_HUMAN,P02776,Platelet factor 4,P02776,,MSSAAGFCASRPGLLFLGLLLLPLVVAFASAEAEEDGDLQCLCVKTTSQVRPRHITSLEVIKAGPHCPTAQLIATLKNGRKICLDLQAPLYKKIIKKLLES,83,100,18,LDLQAPLYKKIIKKLLES,2112.29216469,2113.61198,,,,,1
