PFR,UniProt Id,Entry Accession,Entry Description,Isoform Accession,Isoform Description,Isoform Sequence,Start,End,Length,Proteoform Sequence,Monoisotopic Mass,Average Mass,Sequence Modifications,PTMs,N-Terminal,C-Terminal,Star
1212,PRPC_HUMAN,P02810,Salivary acidic proline-rich phosphoprotein 1/2,P02810,,MLLILLSVALLAFSSAQDLDEDVSQEDVPLVISDGGDSEQFIDEERQGPPLGGQQSQPSAGDGNQDDGPQQGPPQQGGQQQQGPPPPQGKPQGPPQQGGHPPPPQGRPQGPPQQGGHPRPPRGRPQGPPQQGGHQQGPPPPPPGKPQGPPPQGGRPQGPPQGQSPQ,122,165,44,GRPQGPPQQGGHQQGPPPPPPGKPQGPPPQGGRPQGPPQGQSPQ,4368.17604469,4370.77618,,,,,1
2091,PRPC_HUMAN,P02810,Salivary acidic proline-rich phosphoprotein 1/2,P02810,,MLLILLSVALLAFSSAQDLDEDVSQEDVPLVISDGGDSEQFIDEERQGPPLGGQQSQPSAGDGNQDDGPQQGPPQQGGQQQQGPPPPQGKPQGPPQQGGHPPPPQGRPQGPPQQGGHPRPPRGRPQGPPQQGGHQQGPPPPPPGKPQGPPPQGGRPQGPPQGQSPQ,1,165,165,LLILLSVALLAFSSAQDLDEDVSQEDVPLVISDGGDSEQFIDEERQGPPLGGQQSQPSAGDGNQDDGPQQGPPQQGGQQQQGPPPPQGKPQGPPQQGGHPPPPQGRPQGPPQQGGHPRPPRGRPQGPPQQGGHQQGPPPPPPGKPQGPPPQGGRPQGPPQGQSPQ,16875.24376469,16885.26258,,,,,1
2096,PRPC_HUMAN,P02810,Salivary acidic proline-rich phosphoprotein 1/2,P02810,,MLLILLSVALLAFSSAQDLDEDVSQEDVPLVISDGGDSEQFIDEERQGPPLGGQQSQPSAGDGNQDDGPQQGPPQQGGQQQQGPPPPQGKPQGPPQQGGHPPPPQGRPQGPPQQGGHPRPPRGRPQGPPQQGGHQQGPPPPPPGKPQGPPPQGGRPQGPPQGQSPQ,1,165,165,LLILLSVALLAFSSAQDLDEDVSQEDVPLVISDGGDSEQFIDEERQGPPLGGQQSQPSAGDGNQDDGPQQGPPQQGGQQQQGPPPPQGKPQGPPQQGGHPPPPQGRPQGPPQQGGHPRPPRGRPQGPPQQGGHQQGPPPPPPGKPQGPPPQGGRPQGPPQGQSPQ,16955.21009569,16965.24258,,RESID:37@22,,,1
2399,PRPC_HUMAN,P02810,Salivary acidic proline-rich phosphoprotein 1/2,P02810,,MLLILLSVALLAFSSAQDLDEDVSQEDVPLVISDGGDSEQFIDEERQGPPLGGQQSQPSAGDGNQDDGPQQGPPQQGGQQQQGPPPPQGKPQGPPQQGGHPPPPQGRPQGPPQQGGHPRPPRGRPQGPPQQGGHQQGPPPPPPGKPQGPPPQGGRPQGPPQGQSPQ,16,121,106,QDLDEDVSQEDVPLVISDGGDSEQFIDEERQGPPLGGQQSQPSAGDGNQDDGPQQGPPQQGGQQQQGPPPPQGKPQGPPQQGGHPPPPQGRPQGPPQQGGHPRPPR,11055.15618969,11061.64568,,RESID:45@0,,,1
2452,PRPC_HUMAN,P02810,Salivary acidic proline-rich phosphoprotein 1/2,P02810,,MLLILLSVALLAFSSAQDLDEDVSQEDVPLVISDGGDSEQFIDEERQGPPLGGQQSQPSAGDGNQDDGPQQGPPQQGGQQQQGPPPPQGKPQGPPQQGGHPPPPQGRPQGPPQQGGHPRPPRGRPQGPPQQGGHQQGPPPPPPGKPQGPPPQGGRPQGPPQGQSPQ,0,165,166,MLLILLSVALLAFSSAQDLDEDVSQEDVPLVISDGGDSEQFIDEERQGPPLGGQQSQPSAGDGNQDDGPQQGPPQQGGQQQQGPPPPQGKPQGPPQQGGHPPPPQGRPQGPPQQGGHPRPPRGRPQGPPQQGGHQQGPPPPPPGKPQGPPPQGGRPQGPPQGQSPQ,17006.28425469,17016.45518,,,,,1
2664,PRPC_HUMAN,P02810,Salivary acidic proline-rich phosphoprotein 1/2,P02810,,MLLILLSVALLAFSSAQDLDEDVSQEDVPLVISDGGDSEQFIDEERQGPPLGGQQSQPSAGDGNQDDGPQQGPPQQGGQQQQGPPPPQGKPQGPPQQGGHPPPPQGRPQGPPQQGGHPRPPRGRPQGPPQQGGHQQGPPPPPPGKPQGPPPQGGRPQGPPQGQSPQ,0,165,166,MLLILLSVALLAFSSAQDLDEDVSQEDVPLVISDGGDSEQFIDEERQGPPLGGQQSQPSAGDGNQDDGPQQGPPQQGGQQQQGPPPPQGKPQGPPQQGGHPPPPQGRPQGPPQQGGHPRPPRGRPQGPPQQGGHQQGPPPPPPGKPQGPPPQGGRPQGPPQGQSPQ,17048.29481969,17058.49518,,RESID:49@0,,,1
3102,PRPC_HUMAN,P02810,Salivary acidic proline-rich phosphoprotein 1/2,P02810,,MLLILLSVALLAFSSAQDLDEDVSQEDVPLVISDGGDSEQFIDEERQGPPLGGQQSQPSAGDGNQDDGPQQGPPQQGGQQQQGPPPPQGKPQGPPQQGGHPPPPQGRPQGPPQQGGHPRPPRGRPQGPPQQGGHQQGPPPPPPGKPQGPPPQGGRPQGPPQGQSPQ,16,165,150,QDLDEDVSQEDVPLVISDGGDSEQFIDEERQGPPLGGQQSQPSAGDGNQDDGPQQGPPQQGGQQQQGPPPPQGKPQGPPQQGGHPPPPQGRPQGPPQQGGHPRPPRGRPQGPPQQGGHQQGPPPPPPGKPQGPPPQGGRPQGPPQGQSPQ,15405.32166969,15414.40658,,RESID:45@0,,,1
7625,PRPC_HUMAN,P02810,Salivary acidic proline-rich phosphoprotein 1/2,P02810,,MLLILLSVALLAFSSAQDLDEDVSQEDVPLVISDGGDSEQFIDEERQGPPLGGQQSQPSAGDGNQDDGPQQGPPQQGGQQQQGPPPPQGKPQGPPQQGGHPPPPQGRPQGPPQQGGHPRPPRGRPQGPPQQGGHQQGPPPPPPGKPQGPPPQGGRPQGPPQGQSPQ,122,165,44,GRPQGPPQQGGHQQGPPPPPPGKPQGPPPQGGRPQGPPQGQSPQ,4410.18660969,4412.81618,,RESID:46@0,,,1
14469,PRPC_HUMAN,P02810,Salivary acidic proline-rich phosphoprotein 1/2,P02810,,MLLILLSVALLAFSSAQDLDEDVSQEDVPLVISDGGDSEQFIDEERQGPPLGGQQSQPSAGDGNQDDGPQQGPPQQGGQQQQGPPPPQGKPQGPPQQGGHPPPPQGRPQGPPQQGGHPRPPRGRPQGPPQQGGHQQGPPPPPPGKPQGPPPQGGRPQGPPQGQSPQ,1,165,165,LLILLSVALLAFSSAQDLDEDVSQEDVPLVISDGGDSEQFIDEERQGPPLGGQQSQPSAGDGNQNDGPQQGPPQQGGQQQQGPPPPQGKPQGPPQQGGHPPPPQGRPQGPPQQGGHPRPPRGRPQGPPQQGGHQQGPPPPPPGKPQGPPPQGGRPQGPPQGQSPQ,17034.19241669,17044.23778,PSI-MOD:12@65,RESID:37@31|RESID:37@36,,,1
14470,PRPC_HUMAN,P02810,Salivary acidic proline-rich phosphoprotein 1/2,P02810,,MLLILLSVALLAFSSAQDLDEDVSQEDVPLVISDGGDSEQFIDEERQGPPLGGQQSQPSAGDGNQDDGPQQGPPQQGGQQQQGPPPPQGKPQGPPQQGGHPPPPQGRPQGPPQQGGHPRPPRGRPQGPPQQGGHQQGPPPPPPGKPQGPPPQGGRPQGPPQGQSPQ,0,165,166,MLLILLSVALLAFSSAQDLNEDVSQEDVPLVISDGGDSEQFIDEERQGPPLGGQQSQPSAGDGNQDDGPQQGPPQQGGQQQQGPPPPQGKPQGPPQQGGHPPPPQGRPQGPPQQGGHPRPPRGRPQGPPQQGGHQQGPPPPPPGKPQGPPPQGGRPQGPPQGQSPQ,17165.23290669,17175.43038,PSI-MOD:12@19,RESID:37@32|RESID:37@37,,,1
16250,PRPC_HUMAN,P02810,Salivary acidic proline-rich phosphoprotein 1/2,P02810,,MLLILLSVALLAFSSAQDLDEDVSQEDVPLVISDGGDSEQFIDEERQGPPLGGQQSQPSAGDGNQDDGPQQGPPQQGGQQQQGPPPPQGKPQGPPQQGGHPPPPQGRPQGPPQQGGHPRPPRGRPQGPPQQGGHQQGPPPPPPGKPQGPPPQGGRPQGPPQGQSPQ,122,156,35,GRPQGPPQQGGHQQGPPPPPPGKPQGPPPQGGRPQ,3491.767075,3493.85198,,,,,0
16959,PRPC_HUMAN,P02810,Salivary acidic proline-rich phosphoprotein 1/2,P02810,,MLLILLSVALLAFSSAQDLDEDVSQEDVPLVISDGGDSEQFIDEERQGPPLGGQQSQPSAGDGNQDDGPQQGPPQQGGQQQQGPPPPQGKPQGPPQQGGHPPPPQGRPQGPPQQGGHPRPPRGRPQGPPQQGGHQQGPPPPPPGKPQGPPPQGGRPQGPPQGQSPQ,122,164,43,GRPQGPPQQGGHQQGPPPPPPGKPQGPPPQGGRPQGPPQGQSP,4240.117465,4242.64548,,,,,0
17044,PRPC_HUMAN,P02810,Salivary acidic proline-rich phosphoprotein 1/2,P02810,,MLLILLSVALLAFSSAQDLDEDVSQEDVPLVISDGGDSEQFIDEERQGPPLGGQQSQPSAGDGNQDDGPQQGPPQQGGQQQQGPPPPQGKPQGPPQQGGHPPPPQGRPQGPPQQGGHPRPPRGRPQGPPQQGGHQQGPPPPPPGKPQGPPPQGGRPQGPPQGQSPQ,122,146,25,GRPQGPPQQGGHQQGPPPPPPGKPQ,2520.273385,2521.78058,,,,,0
17635,PRPC_HUMAN,P02810,Salivary acidic proline-rich phosphoprotein 1/2,P02810,,MLLILLSVALLAFSSAQDLDEDVSQEDVPLVISDGGDSEQFIDEERQGPPLGGQQSQPSAGDGNQDDGPQQGPPQQGGQQQQGPPPPQGKPQGPPQQGGHPPPPQGRPQGPPQQGGHPRPPRGRPQGPPQQGGHQQGPPPPPPGKPQGPPPQGGRPQGPPQGQSPQ,16,121,106,QDLDEDVSQEDVPLVISDGGDSEQFIDEERQGPPLGGQQSQPSAGDGNQDDGPQQGPPQQGGQQQQGPPPPQGKPQGPPQQGGHPPPPQGRPQGPPQQGGHPRPPR,11156.05174,11162.53568,,RESID:31@0|RESID:37@16|RESID:37@21,,,0
17650,PRPC_HUMAN,P02810,Salivary acidic proline-rich phosphoprotein 1/2,P02810,,MLLILLSVALLAFSSAQDLDEDVSQEDVPLVISDGGDSEQFIDEERQGPPLGGQQSQPSAGDGNQDDGPQQGPPQQGGQQQQGPPPPQGKPQGPPQQGGHPPPPQGRPQGPPQQGGHPRPPRGRPQGPPQQGGHQQGPPPPPPGKPQGPPPQGGRPQGPPQGQSPQ,16,121,106,QDLDEDVSQEDVPLVISDGGDSEQFIDEERQGPPLGGQQSQPSAGDGNQDDGPQQGPPQQGGQQQQGPPPPQGKPQGPPQQGGHPPPPQGRPQGPPQQGGHPRPPR,11055.15619,11061.64568,,,PSI-MOD:1458,,0
17652,PRPC_HUMAN,P02810,Salivary acidic proline-rich phosphoprotein 1/2,P02810,,MLLILLSVALLAFSSAQDLDEDVSQEDVPLVISDGGDSEQFIDEERQGPPLGGQQSQPSAGDGNQDDGPQQGPPQQGGQQQQGPPPPQGKPQGPPQQGGHPPPPQGRPQGPPQQGGHPRPPRGRPQGPPQQGGHQQGPPPPPPGKPQGPPPQGGRPQGPPQGQSPQ,16,121,106,QDLDEDVSQEDVPLVISDGGDSEQFIDEERQGPPLGGQQSQPSAGDGNQDDGPQQGPPQQGGQQQQGPPPPQGKPQGPPQQGGHPPPPQGRPQGPPQQGGHPRPPR,10996.11908,11002.57568,,RESID:31@0,,,0
17662,PRPC_HUMAN,P02810,Salivary acidic proline-rich phosphoprotein 1/2,P02810,,MLLILLSVALLAFSSAQDLDEDVSQEDVPLVISDGGDSEQFIDEERQGPPLGGQQSQPSAGDGNQDDGPQQGPPQQGGQQQQGPPPPQGKPQGPPQQGGHPPPPQGRPQGPPQQGGHPRPPRGRPQGPPQQGGHQQGPPPPPPGKPQGPPPQGGRPQGPPQGQSPQ,16,165,150,QDLDEDVSQEDVPLVISDGGDSEQFIDEERQGPPLGGQQSQPSAGDGNQDDGPQQGPPQQGGQQQQGPPPPQGKPQGPPQQGGHPPPPQGRPQGPPQQGGHPRPPRGRPQGPPQQGGHQQGPPPPPPGKPQGPPPQGGRPQGPPQGQSPQ,15426.25089,15435.31658,,RESID:31@0|RESID:37@7,,,0
17679,PRPC_HUMAN,P02810,Salivary acidic proline-rich phosphoprotein 1/2,P02810,,MLLILLSVALLAFSSAQDLDEDVSQEDVPLVISDGGDSEQFIDEERQGPPLGGQQSQPSAGDGNQDDGPQQGPPQQGGQQQQGPPPPQGKPQGPPQQGGHPPPPQGRPQGPPQQGGHPRPPRGRPQGPPQQGGHQQGPPPPPPGKPQGPPPQGGRPQGPPQGQSPQ,16,121,106,QDLDEDVSQEDVPLVISDGGDSEQFIDEERQGPPLGGQQSQPSAGDGNQDDGPQQGPPQQGGQQQQGPPPPQGKPQGPPQQGGHPPPPQGRPQGPPQQGGHPRPPR,11076.08541,11082.55568,,RESID:31@0|RESID:37@7,,,0
17716,PRPC_HUMAN,P02810,Salivary acidic proline-rich phosphoprotein 1/2,P02810,,MLLILLSVALLAFSSAQDLDEDVSQEDVPLVISDGGDSEQFIDEERQGPPLGGQQSQPSAGDGNQDDGPQQGPPQQGGQQQQGPPPPQGKPQGPPQQGGHPPPPQGRPQGPPQQGGHPRPPRGRPQGPPQQGGHQQGPPPPPPGKPQGPPPQGGRPQGPPQGQSPQ,16,165,150,QDLDEDVSQEDVPLVISDGGDSEQFIDEERQGPPLGGQQSQPSAGDGNQDDGPQQGPPQQGGQQQQGPPPPQGKPQGPPQQGGHPPPPQGRPQGPPQQGGHPRPPRGRPQGPPQQGGHQQGPPPPPPGKPQGPPPQGGRPQGPPQGQSPQ,15426.25089,15435.31658,,RESID:31@0|RESID:37@21,,,0
17802,PRPC_HUMAN,P02810,Salivary acidic proline-rich phosphoprotein 1/2,P02810,,MLLILLSVALLAFSSAQDLDEDVSQEDVPLVISDGGDSEQFIDEERQGPPLGGQQSQPSAGDGNQDDGPQQGPPQQGGQQQQGPPPPQGKPQGPPQQGGHPPPPQGRPQGPPQQGGHPRPPRGRPQGPPQQGGHQQGPPPPPPGKPQGPPPQGGRPQGPPQGQSPQ,82,121,40,GPPPPQGKPQGPPQQGGHPPPPQGRPQGPPQQGGHPRPPR,4076.085375,4078.53068,,,,,0
17821,PRPC_HUMAN,P02810,Salivary acidic proline-rich phosphoprotein 1/2,P02810,,MLLILLSVALLAFSSAQDLDEDVSQEDVPLVISDGGDSEQFIDEERQGPPLGGQQSQPSAGDGNQDDGPQQGPPQQGGQQQQGPPPPQGKPQGPPQQGGHPPPPQGRPQGPPQQGGHPRPPRGRPQGPPQQGGHQQGPPPPPPGKPQGPPPQGGRPQGPPQGQSPQ,84,121,38,PPPQGKPQGPPQQGGHPPPPQGRPQGPPQQGGHPRPPR,3922.011155,3924.36208,,,,,0
17850,PRPC_HUMAN,P02810,Salivary acidic proline-rich phosphoprotein 1/2,P02810,,MLLILLSVALLAFSSAQDLDEDVSQEDVPLVISDGGDSEQFIDEERQGPPLGGQQSQPSAGDGNQDDGPQQGPPQQGGQQQQGPPPPQGKPQGPPQQGGHPPPPQGRPQGPPQQGGHPRPPRGRPQGPPQQGGHQQGPPPPPPGKPQGPPPQGGRPQGPPQGQSPQ,83,121,39,PPPPQGKPQGPPQQGGHPPPPQGRPQGPPQQGGHPRPPR,4019.063915,4021.47878,,,,,0
17858,PRPC_HUMAN,P02810,Salivary acidic proline-rich phosphoprotein 1/2,P02810,,MLLILLSVALLAFSSAQDLDEDVSQEDVPLVISDGGDSEQFIDEERQGPPLGGQQSQPSAGDGNQDDGPQQGPPQQGGQQQQGPPPPQGKPQGPPQQGGHPPPPQGRPQGPPQQGGHPRPPRGRPQGPPQQGGHQQGPPPPPPGKPQGPPPQGGRPQGPPQGQSPQ,16,165,150,QDLDEDVSQEDVPLVISDGGDSEQFIDEERQGPPLGGQQSQPSAGDGNQDDGPQQGPPQQGGQQQQGPPPPQGKPQGPPQQGGHPPPPQGRPQGPPQQGGHPRPPRGRPQGPPQQGGHQQGPPPPPPGKPQGPPPQGGRPQGPPQGQSPQ,15346.28456,15355.33658,,RESID:31@0,,,0
18005,PRPC_HUMAN,P02810,Salivary acidic proline-rich phosphoprotein 1/2,P02810,,MLLILLSVALLAFSSAQDLDEDVSQEDVPLVISDGGDSEQFIDEERQGPPLGGQQSQPSAGDGNQDDGPQQGPPQQGGQQQQGPPPPQGKPQGPPQQGGHPPPPQGRPQGPPQQGGHPRPPRGRPQGPPQQGGHQQGPPPPPPGKPQGPPPQGGRPQGPPQGQSPQ,81,121,41,QGPPPPQGKPQGPPQQGGHPPPPQGRPQGPPQQGGHPRPPR,4204.143955,4206.66138,,,,,0
18026,PRPC_HUMAN,P02810,Salivary acidic proline-rich phosphoprotein 1/2,P02810,,MLLILLSVALLAFSSAQDLDEDVSQEDVPLVISDGGDSEQFIDEERQGPPLGGQQSQPSAGDGNQDDGPQQGPPQQGGQQQQGPPPPQGKPQGPPQQGGHPPPPQGRPQGPPQQGGHPRPPRGRPQGPPQQGGHQQGPPPPPPGKPQGPPPQGGRPQGPPQGQSPQ,85,121,37,PPQGKPQGPPQQGGHPPPPQGRPQGPPQQGGHPRPPR,3824.958395,3827.24538,,,,,0
