PFR,UniProt Id,Entry Accession,Entry Description,Isoform Accession,Isoform Description,Isoform Sequence,Start,End,Length,Proteoform Sequence,Monoisotopic Mass,Average Mass,Sequence Modifications,PTMs,N-Terminal,C-Terminal,Star
1331,QCR6_HUMAN,P07919,Cytochrome b-c1 complex subunit 6; mitochondrial,P07919,,MGLEDEQKMLTESGDPEEEEEEEEELVDPLTTVREQCEQLEKCVKARERLELCDERVSSRSHTEEDCTEELFDFLHARDHCVAHKLFNNLK,13,90,78,GDPEEEEEEEEELVDPLTTVREQCEQLEKCVKARERLELCDERVSSRSHTEEDCTEELFDFLHARDHCVAHKLFNNLK,9240.28146469,9246.09428,,,,,1
12807,QCR6_HUMAN,P07919,Cytochrome b-c1 complex subunit 6; mitochondrial,P07919,,MGLEDEQKMLTESGDPEEEEEEEEELVDPLTTVREQCEQLEKCVKARERLELCDERVSSRSHTEEDCTEELFDFLHARDHCVAHKLFNNLK,13,90,78,GDPEEEEEEEEELVDPLTTVREQCEQLEKCVKARERLQLCDERVSSRSHTEEDCTEELFDFLHARDHCVAHKLFNNLK,9239.29745468999,9245.10948,PSI-MOD:16@50,,,,1
12860,QCR6_HUMAN,P07919,Cytochrome b-c1 complex subunit 6; mitochondrial,P07919,,MGLEDEQKMLTESGDPEEEEEEEEELVDPLTTVREQCEQLEKCVKARERLELCDERVSSRSHTEEDCTEELFDFLHARDHCVAHKLFNNLK,13,90,78,GDPEEEEEEEEELVDPLTTVREQCEQLEKCVKARERLELCDERVSSRSHTEEDCTEELFDFLHARDHCVAHKLFNNLK,9362.25836069,9368.11428,,RESID:55@28|RESID:38@49,,,1
12861,QCR6_HUMAN,P07919,Cytochrome b-c1 complex subunit 6; mitochondrial,P07919,,MGLEDEQKMLTESGDPEEEEEEEEELVDPLTTVREQCEQLEKCVKARERLELCDERVSSRSHTEEDCTEELFDFLHARDHCVAHKLFNNLK,0,90,91,MGLEDEQKMLTESGDPEEEEEEEEELVDPLTTVREQCEQLEKCVKARERLELCDERVSSRSHTEEDCTEELFDFLHARDHCVAHKLFNNLK,10773.95054969,10780.81338,,RESID:49@0,,,1
13439,QCR6_HUMAN,P07919,Cytochrome b-c1 complex subunit 6; mitochondrial,P07919,,MGLEDEQKMLTESGDPEEEEEEEEELVDPLTTVREQCEQLEKCVKARERLELCDERVSSRSHTEEDCTEELFDFLHARDHCVAHKLFNNLK,1,90,90,GLEDEQKMLTESGDPEEEEEEEEELVDPLTTVREQCEQLEKCVKARERLELCDERVSSRSHTEEDCTEELFDFLHARDHCVAHKLFNNLK,10600.89949469,10607.58078,,,,,1
13447,QCR6_HUMAN,P07919,Cytochrome b-c1 complex subunit 6; mitochondrial,P07919,,MGLEDEQKMLTESGDPEEEEEEEEELVDPLTTVREQCEQLEKCVKARERLELCDERVSSRSHTEEDCTEELFDFLHARDHCVAHKLFNNLK,13,90,78,GDPEEEEEEEEELVDPLTTVREQCEQLEKCVKARERLQLCDERVSSRSHTEEDCTEELFDFLHARDHCVAHKLFNNLK,9281.30801969,9287.14948,PSI-MOD:16@50,RESID:55@28,,,1
13652,QCR6_HUMAN,P07919,Cytochrome b-c1 complex subunit 6; mitochondrial,P07919,,MGLEDEQKMLTESGDPEEEEEEEEELVDPLTTVREQCEQLEKCVKARERLELCDERVSSRSHTEEDCTEELFDFLHARDHCVAHKLFNNLK,13,90,78,GDPEEEEEEEEELVDPLTTVREQCEQLEKCVKARERLELCDERVSSRSHTEEDCTEELFDFLHARDHCVAHKLFNNLK,9282.29202969,9288.13428,,RESID:55@28,,,1
13653,QCR6_HUMAN,P07919,Cytochrome b-c1 complex subunit 6; mitochondrial,P07919,,MGLEDEQKMLTESGDPEEEEEEEEELVDPLTTVREQCEQLEKCVKARERLELCDERVSSRSHTEEDCTEELFDFLHARDHCVAHKLFNNLK,13,90,78,GDPEEEEEEEEELVDPLTTVREQCEQLEKCVKARERLELCDERVSSRSHTEEDCTEELFDFLHARDHCVAHKLFNNLK,9404.26892569,9410.15428,,RESID:55@28|RESID:38@49|RESID:55@71,,,1
13654,QCR6_HUMAN,P07919,Cytochrome b-c1 complex subunit 6; mitochondrial,P07919,,MGLEDEQKMLTESGDPEEEEEEEEELVDPLTTVREQCEQLEKCVKARERLELCDERVSSRSHTEEDCTEELFDFLHARDHCVAHKLFNNLK,13,90,78,GDPEEEEEEEEELVDPLTTVREQCEQLEKCVKARERLELCDERVSSRSHTEEDCTEELFDFLHARDHCVAHKLFNNLK,9324.30259469,9330.17428,,RESID:55@28|RESID:55@71,,,1
13655,QCR6_HUMAN,P07919,Cytochrome b-c1 complex subunit 6; mitochondrial,P07919,,MGLEDEQKMLTESGDPEEEEEEEEELVDPLTTVREQCEQLEKCVKARERLELCDERVSSRSHTEEDCTEELFDFLHARDHCVAHKLFNNLK,13,90,78,GDPEEEEEEEEELVDPLTTVREQCEQLEKCVKARERLQLCDERVSSRSHTEEDCTEELFDFLHARDHCVAHKLFNNLK,9323.31858469,9329.18948,PSI-MOD:16@50,RESID:55@28|RESID:55@71,,,1
