PFR,UniProt Id,Entry Accession,Entry Description,Isoform Accession,Isoform Description,Isoform Sequence,Start,End,Length,Proteoform Sequence,Monoisotopic Mass,Average Mass,Sequence Modifications,PTMs,N-Terminal,C-Terminal,Star
10804,CYPH_YEAST,P14832,Peptidyl-prolyl cis-trans isomerase,P14832,,MSQVYFDVEADGQPIGRVVFKLYNDIVPKTAENFRALCTGEKGFGYAGSPFHRVIPDFMLQGGDFTAGNGTGGKSIYGGKFPDENFKKHHDRPGLLSMANAGPNTNGSQFFITTVPCPWLDGKHVVFGEVVDGYDIVKKVESLGSPSGATKARIVVAKSGEL,0,161,162,MSQVYFDVEADGQPIGRVVFKLYNDIVPKTAENFRALCTGEKGFGYAGSPFHRVIPDFMLQGGDFTAGNGTGGKSIYGGKFPDENFKKHHDRPGLLSMANAGPNTNGSQFFITTVPCPWLDGKHVVFGEVVDGYDIVKKVESLGSPSGATKARIVVAKSGEL,17421.70996969,17432.73138,,PSI-MOD:394@0,,,1
10885,CYPH_YEAST,P14832,Peptidyl-prolyl cis-trans isomerase,P14832,,MSQVYFDVEADGQPIGRVVFKLYNDIVPKTAENFRALCTGEKGFGYAGSPFHRVIPDFMLQGGDFTAGNGTGGKSIYGGKFPDENFKKHHDRPGLLSMANAGPNTNGSQFFITTVPCPWLDGKHVVFGEVVDGYDIVKKVESLGSPSGATKARIVVAKSGEL,1,161,161,SQVYFDVEADGQPIGRVVFKLYNDIVPKTAENFRALCTGEKGFGYAGSPFHRVIPDFMLQGGDFTAGNGTGGKSIYGGKFPDENFKKHHDRPGLLSMANAGPNTNGSQFFITTVPCPWLDGKHVVFGEVVDGYDIVKKVESLGSPSGATKARIVVAKSGEL,17290.66947969,17301.53878,,PSI-MOD:394@0,,,1
11110,CYPH_YEAST,P14832,Peptidyl-prolyl cis-trans isomerase,P14832,,MSQVYFDVEADGQPIGRVVFKLYNDIVPKTAENFRALCTGEKGFGYAGSPFHRVIPDFMLQGGDFTAGNGTGGKSIYGGKFPDENFKKHHDRPGLLSMANAGPNTNGSQFFITTVPCPWLDGKHVVFGEVVDGYDIVKKVESLGSPSGATKARIVVAKSGEL,40,161,122,EKGFGYAGSPFHRVIPDFMLQGGDFTAGNGTGGKSIYGGKFPDENFKKHHDRPGLLSMANAGPNTNGSQFFITTVPCPWLDGKHVVFGEVVDGYDIVKKVESLGSPSGATKARIVVAKSGEL,12907.46976469,12915.57468,,,,,1
11394,CYPH_YEAST,P14832,Peptidyl-prolyl cis-trans isomerase,P14832,,MSQVYFDVEADGQPIGRVVFKLYNDIVPKTAENFRALCTGEKGFGYAGSPFHRVIPDFMLQGGDFTAGNGTGGKSIYGGKFPDENFKKHHDRPGLLSMANAGPNTNGSQFFITTVPCPWLDGKHVVFGEVVDGYDIVKKVESLGSPSGATKARIVVAKSGEL,0,161,162,MSQVYFDVEADGQPIGRVVFKLYNDIVPKTAENFRALCTGEKGFGYAGSPFHRVIPDFMLQGGDFTAGNGTGGKSIYGGKFPDENFKKHHDRPGLLSMANAGPNTNGSQFFITTVPCPWLDGKHVVFGEVVDGYDIVKKVESLGSPSGATKARIVVAKSGEL,17379.69940469,17390.69138,,,,,1
11442,CYPH_YEAST,P14832,Peptidyl-prolyl cis-trans isomerase,P14832,,MSQVYFDVEADGQPIGRVVFKLYNDIVPKTAENFRALCTGEKGFGYAGSPFHRVIPDFMLQGGDFTAGNGTGGKSIYGGKFPDENFKKHHDRPGLLSMANAGPNTNGSQFFITTVPCPWLDGKHVVFGEVVDGYDIVKKVESLGSPSGATKARIVVAKSGEL,115,161,47,PCPWLDGKHVVFGEVVDGYDIVKKVESLGSPSGATKARIVVAKSGEL,4936.61596469,4939.70488,,,,,1
11463,CYPH_YEAST,P14832,Peptidyl-prolyl cis-trans isomerase,P14832,,MSQVYFDVEADGQPIGRVVFKLYNDIVPKTAENFRALCTGEKGFGYAGSPFHRVIPDFMLQGGDFTAGNGTGGKSIYGGKFPDENFKKHHDRPGLLSMANAGPNTNGSQFFITTVPCPWLDGKHVVFGEVVDGYDIVKKVESLGSPSGATKARIVVAKSGEL,13,161,149,PIGRVVFKLYNDIVPKTAENFRALCTGEKGFGYAGSPFHRVIPDFMLQGGDFTAGNGTGGKSIYGGKFPDENFKKHHDRPGLLSMANAGPNTNGSQFFITTVPCPWLDGKHVVFGEVVDGYDIVKKVESLGSPSGATKARIVVAKSGEL,15910.08612469,15920.11798,,,,,1
11594,CYPH_YEAST,P14832,Peptidyl-prolyl cis-trans isomerase,P14832,,MSQVYFDVEADGQPIGRVVFKLYNDIVPKTAENFRALCTGEKGFGYAGSPFHRVIPDFMLQGGDFTAGNGTGGKSIYGGKFPDENFKKHHDRPGLLSMANAGPNTNGSQFFITTVPCPWLDGKHVVFGEVVDGYDIVKKVESLGSPSGATKARIVVAKSGEL,1,161,161,SQVYFDVEADGQPIGRVVFKLYNDIVPKTAENFRALCTGEKGFGYAGSPFHRVIPDFMLQGGDFTAGNGTGGKSIYGGKFPDENFKKHHDRPGLLSMANAGPNTNGSQFFITTVPCPWLDGKHVVFGEVVDGYDIVKKVESLGSPSGATKARIVVAKSGEL,17248.65891469,17259.49878,,,,,1
11625,CYPH_YEAST,P14832,Peptidyl-prolyl cis-trans isomerase,P14832,,MSQVYFDVEADGQPIGRVVFKLYNDIVPKTAENFRALCTGEKGFGYAGSPFHRVIPDFMLQGGDFTAGNGTGGKSIYGGKFPDENFKKHHDRPGLLSMANAGPNTNGSQFFITTVPCPWLDGKHVVFGEVVDGYDIVKKVESLGSPSGATKARIVVAKSGEL,29,161,133,TAENFRALCTGEKGFGYAGSPFHRVIPDFMLQGGDFTAGNGTGGKSIYGGKFPDENFKKHHDRPGLLSMANAGPNTNGSQFFITTVPCPWLDGKHVVFGEVVDGYDIVKKVESLGSPSGATKARIVVAKSGEL,14071.00909469,14079.87598,,,,,1
