PFR,UniProt Id,Entry Accession,Entry Description,Isoform Accession,Isoform Description,Isoform Sequence,Start,End,Length,Proteoform Sequence,Monoisotopic Mass,Average Mass,Sequence Modifications,PTMs,N-Terminal,C-Terminal,Star
1409,QCR7_HUMAN,P14927,Cytochrome b-c1 complex subunit 7,P14927-1,1,MAGKQAVSASGKWLDGIRKWYYNAAGFNKLGLMRDDTIYEDEDVKEAIRRLPENLYNDRMFRIKRALDLNLKHQILPKEQWTKYEEENFYLEPYLKEVIRERKEREEWAKK,1,110,110,AGKQAVSASGKWLDGIRKWYYNAAGFNKLGLMRDDTIYEDEDVKEAIRRLPENLYNDRMFRIKRALDLNLKHQILPKEQWTKYEEENFYLEPYLKEVIRERKEREEWAKK,13432.94666969,13441.30078,,RESID:41@0,,,1
12393,QCR7_HUMAN,P14927,Cytochrome b-c1 complex subunit 7,P14927-1,1,MAGKQAVSASGKWLDGIRKWYYNAAGFNKLGLMRDDTIYEDEDVKEAIRRLPENLYNDRMFRIKRALDLNLKHQILPKEQWTKYEEENFYLEPYLKEVIRERKEREEWAKK,1,110,110,AGKQAVSASGKWLDGIRKWYYNAAGFNKLGLMRDDTIYEDEDVKEAIRRLPENLYNDRMFRIKRALDLNLKHQILPKEQWTKYEEENFYLEPYLKEVIRERKEREEWAKK,13432.94666969,13441.30078,,RESID:55@10,,,1
12541,QCR7_HUMAN,P14927,Cytochrome b-c1 complex subunit 7,P14927-1,1,MAGKQAVSASGKWLDGIRKWYYNAAGFNKLGLMRDDTIYEDEDVKEAIRRLPENLYNDRMFRIKRALDLNLKHQILPKEQWTKYEEENFYLEPYLKEVIRERKEREEWAKK,1,110,110,AGKQAVSASGKWLDGIRKWYYNAAGFNKPGLMRDDTIYEDEDVKEAIRRLPENLYNDRMFRIKRALDLNLKHQILPKEQWTKYEEENFYLEPYLKEVIRERKEREEWAKK,13416.91536969,13425.25808,PSI-MOD:24@29,RESID:41@0,,,1
12609,QCR7_HUMAN,P14927,Cytochrome b-c1 complex subunit 7,P14927-1,1,MAGKQAVSASGKWLDGIRKWYYNAAGFNKLGLMRDDTIYEDEDVKEAIRRLPENLYNDRMFRIKRALDLNLKHQILPKEQWTKYEEENFYLEPYLKEVIRERKEREEWAKK,1,110,110,AGKQAVSASGKWLDGIRKWYYNAAGFNKLGLMRDDTIYEDEDVKEAIRRLPENLYNDRMFRIKRALDLNLKHQILPKEQWTKYEEENFYLEPYLKEVIRERKEREEWAKK,13474.95723469,13483.34078,,RESID:41@0|RESID:55@10,,,1
12806,QCR7_HUMAN,P14927,Cytochrome b-c1 complex subunit 7,P14927-1,1,MAGKQAVSASGKWLDGIRKWYYNAAGFNKLGLMRDDTIYEDEDVKEAIRRLPENLYNDRMFRIKRALDLNLKHQILPKEQWTKYEEENFYLEPYLKEVIRERKEREEWAKK,1,110,110,AGKQAVSASGKWLDGIRKWYYNAAGFNKPGLMRDDTIYEDEDVKEAIRRLPENLYNDRMFRIKRALDLNLKHQILPKEQWTKYEEENFYLEPYLKEVIRERKEREEWAKK,13458.92593469,13467.29808,PSI-MOD:24@29,RESID:41@0|RESID:55@10,,,1
13574,QCR7_HUMAN,P14927,Cytochrome b-c1 complex subunit 7,P14927-1,1,MAGKQAVSASGKWLDGIRKWYYNAAGFNKLGLMRDDTIYEDEDVKEAIRRLPENLYNDRMFRIKRALDLNLKHQILPKEQWTKYEEENFYLEPYLKEVIRERKEREEWAKK,0,110,111,MAGKQAVSASGKWLDGIRKWYYNAAGFNKLGLMRDDTIYEDEDVKEAIRRLPENLYNDRMFRIKRALDLNLKHQILPKEQWTKYEEENFYLEPYLKEVIRERKEREEWAKK,13563.98715969,13572.49338,,RESID:49@0,,,1
15941,QCR7_HUMAN,P14927,Cytochrome b-c1 complex subunit 7,P14927-1,1,MAGKQAVSASGKWLDGIRKWYYNAAGFNKLGLMRDDTIYEDEDVKEAIRRLPENLYNDRMFRIKRALDLNLKHQILPKEQWTKYEEENFYLEPYLKEVIRERKEREEWAKK,1,110,110,AGKQAVSASGKWLDGIRKWYYNAAGFNKLGLMRDDTIYEDEDVKEAIRRLPENLYNDRMFRIKRALDLNLKHQILPKEQWTKYEEENFYLEPYLKEVIRERKEREEWAKK,13432.94667,13441.30078,,,PSI-MOD:1458,,0
18218,QCR7_HUMAN,P14927,Cytochrome b-c1 complex subunit 7,P14927-1,1,MAGKQAVSASGKWLDGIRKWYYNAAGFNKLGLMRDDTIYEDEDVKEAIRRLPENLYNDRMFRIKRALDLNLKHQILPKEQWTKYEEENFYLEPYLKEVIRERKEREEWAKK,0,110,111,MAGKQAVSASGKWLDGIRKWYYNAAGFNKPGLMRDDTIYEDEDVKEAIRRLPENLYNDRMFRIKRALDLNLKHQILPKEQWTKYEEENFYLEPYLKEVIRERKEREEWAKK,13547.95586,13556.45068,PSI-MOD:24@29,RESID:55@82,,,0
