PFR,UniProt Id,Entry Accession,Entry Description,Isoform Accession,Isoform Description,Isoform Sequence,Start,End,Length,Proteoform Sequence,Monoisotopic Mass,Average Mass,Sequence Modifications,PTMs,N-Terminal,C-Terminal,Star
1288,RL35A_HUMAN,P18077,60S ribosomal protein L35a,P18077,,MSGRLWSKAIFAGYKRGLRNQREHTALLKIEGVYARDETEFYLGKRCAYVYKAKNNTVTPGGKPNKTRVIWGKVTRAHGNSGMVRAKFRSNLPAKAIGHRIRVMLYPSRI,1,109,109,SGRLWSKAIFAGYKRGLRNQREHTALLKIEGVYARDETEFYLGKRCAYVYKAKNNTVTPGGKPNKTRVIWGKVTRAHGNSGMVRAKFRSNLPAKAIGHRIRVMLYPSRI,12440.74038969,12448.51918,,RESID:51@0,,,1
3928,RL35A_HUMAN,P18077,60S ribosomal protein L35a,P18077,,MSGRLWSKAIFAGYKRGLRNQREHTALLKIEGVYARDETEFYLGKRCAYVYKAKNNTVTPGGKPNKTRVIWGKVTRAHGNSGMVRAKFRSNLPAKAIGHRIRVMLYPSRI,1,109,109,SGRLWSKAIFAGYKRGLRNQREHTALLKIEGVYARDETEFYLGKRCAYVYKAKNNTVTPGGKPNKTRVIWGKVTRAHGNSGMVRAKFRSNLPAKAIGHRIRVMLYPSRI,12398.72982469,12406.47918,,,,,1
8487,RL35A_HUMAN,P18077,60S ribosomal protein L35a,P18077,,MSGRLWSKAIFAGYKRGLRNQREHTALLKIEGVYARDETEFYLGKRCAYVYKAKNNTVTPGGKPNKTRVIWGKVTRAHGNSGMVRAKFRSNLPAKAIGHRIRVMLYPSRI,1,109,109,SGRLWSKAIFAGYKRGLRNQREHTALLKIEGVYARDETEFYLGKRCAYVYKAKNNTVTPGGKPNKTRVIWGKVTRAHGNSGMVRAKFRSNLPAKAIGHRIRVMLYPSRI,12482.75095469,12490.55918,,RESID:51@0|RESID:55@6,,,1
12474,RL35A_HUMAN,P18077,60S ribosomal protein L35a,P18077,,MSGRLWSKAIFAGYKRGLRNQREHTALLKIEGVYARDETEFYLGKRCAYVYKAKNNTVTPGGKPNKTRVIWGKVTRAHGNSGMVRAKFRSNLPAKAIGHRIRVMLYPSRI,1,109,109,SGRLWSKAIFAGYKRGLRNQREHTALLKIEGVYARDETEFYLGKRCAYVYKAKNNTVTPGGKPNKTRVIWGKVTRAHGNSGMVRAKFRSNLPAKAIGHRIRVMLYPSRI,12440.74038969,12448.51918,,RESID:55@6,,,1
12557,RL35A_HUMAN,P18077,60S ribosomal protein L35a,P18077,,MSGRLWSKAIFAGYKRGLRNQREHTALLKIEGVYARDETEFYLGKRCAYVYKAKNNTVTPGGKPNKTRVIWGKVTRAHGNSGMVRAKFRSNLPAKAIGHRIRVMLYPSRI,1,109,109,SGRLWSKAIFAGYKRGLRNQREHTALLKIEGIYARDETEFYLGKRCAYVYKAKNNTVTPGGKPNKTRVIWGKVTRAHGNSGMVRAKFRSNLPAKAIGHRIRVMLYPSRI,12454.75603969,12462.54598,PSI-MOD:19@32,RESID:51@0,,,1
12683,RL35A_HUMAN,P18077,60S ribosomal protein L35a,P18077,,MSGRLWSKAIFAGYKRGLRNQREHTALLKIEGVYARDETEFYLGKRCAYVYKAKNNTVTPGGKPNKTRVIWGKVTRAHGNSGMVRAKFRSNLPAKAIGHRIRVMLYPSRI,0,109,110,MSGRLWSKAIFAGYKRGLRNQREHTALLKIEGVYARDETEFYLGKRCAYVYKAKNNTVTPGGKPNKTRVIWGKVTRAHGNSGMVRAKFRSNLPAKAIGHRIRVMLYPSRI,12571.78087969,12579.71178,,RESID:49@0,,,1
13230,RL35A_HUMAN,P18077,60S ribosomal protein L35a,P18077,,MSGRLWSKAIFAGYKRGLRNQREHTALLKIEGVYARDETEFYLGKRCAYVYKAKNNTVTPGGKPNKTRVIWGKVTRAHGNSGMVRAKFRSNLPAKAIGHRIRVMLYPSRI,1,109,109,SGRLWSKAIFAGYKRGLRNQREHTALLKIEGIYARDETEFYLGKRCAYVYKAKNNTVTPGGKPNKTRVIWGKVTRAHGNSGMVRAKFRSNLPAKAIGHRIRVMLYPSRI,12454.75603969,12462.54598,PSI-MOD:19@32,RESID:55@6,,,1
15921,RL35A_HUMAN,P18077,60S ribosomal protein L35a,P18077,,MSGRLWSKAIFAGYKRGLRNQREHTALLKIEGVYARDETEFYLGKRCAYVYKAKNNTVTPGGKPNKTRVIWGKVTRAHGNSGMVRAKFRSNLPAKAIGHRIRVMLYPSRI,1,109,109,SGRLWSKAIFAGYKRGLRNQREHTALLKIEGIYARDETEFYLGKRCAYVYKAKNNTVTPGGKPNKTRVIWGKVTRAHGNSGMVRAKFRSNLPAKAIGHRIRVMLYPSRI,12454.75604,12462.54598,PSI-MOD:19@32,,PSI-MOD:1458,,0
15940,RL35A_HUMAN,P18077,60S ribosomal protein L35a,P18077,,MSGRLWSKAIFAGYKRGLRNQREHTALLKIEGVYARDETEFYLGKRCAYVYKAKNNTVTPGGKPNKTRVIWGKVTRAHGNSGMVRAKFRSNLPAKAIGHRIRVMLYPSRI,1,109,109,SGRLWSKAIFAGYKRGLRNQREHTALLKIEGIYARDETEFYLGKRCAYVYKAKNNTVTPGGKPNKTRVIWGKVTRAHGNSGMVRAKFRSNLPAKAIGHRIRVMLYPSRI,12412.74547,12420.50598,PSI-MOD:19@32,,,,0
16114,RL35A_HUMAN,P18077,60S ribosomal protein L35a,P18077,,MSGRLWSKAIFAGYKRGLRNQREHTALLKIEGVYARDETEFYLGKRCAYVYKAKNNTVTPGGKPNKTRVIWGKVTRAHGNSGMVRAKFRSNLPAKAIGHRIRVMLYPSRI,1,109,109,SGRLWSKAIFAGYKRGLRNQREHTALLKIEGVYARDETEFYLGKRCAYVYKAKNNTVTPGGKPNKTRVIWGKVTRAHGNSGMVRAKFRSNLPAKAIGHRIRVMLYPSRI,12440.74039,12448.51918,,,PSI-MOD:1458,,0
16452,RL35A_HUMAN,P18077,60S ribosomal protein L35a,P18077,,MSGRLWSKAIFAGYKRGLRNQREHTALLKIEGVYARDETEFYLGKRCAYVYKAKNNTVTPGGKPNKTRVIWGKVTRAHGNSGMVRAKFRSNLPAKAIGHRIRVMLYPSRI,1,109,109,SGRLWSKAIFAGYKRGLRNQREHTALLKIEGIYARDETEFYLGKRCAYVYKAKNNTVTPGGKPNKTRVIWGKVTRAHGNSGMVRAKFRSNLPAKAIGHRIRVMLYPSRI,12538.77717,12546.62598,PSI-MOD:19@32,RESID:55@6|RESID:55@61,PSI-MOD:1458,,0
16788,RL35A_HUMAN,P18077,60S ribosomal protein L35a,P18077,,MSGRLWSKAIFAGYKRGLRNQREHTALLKIEGVYARDETEFYLGKRCAYVYKAKNNTVTPGGKPNKTRVIWGKVTRAHGNSGMVRAKFRSNLPAKAIGHRIRVMLYPSRI,59,109,51,PGGKPNKTRVIWGKVTRAHGNSGMVRAKFRSNLPAKAIGHRIRVMLYPSRI,5678.189465,5681.76788,,,,,0
17245,RL35A_HUMAN,P18077,60S ribosomal protein L35a,P18077,,MSGRLWSKAIFAGYKRGLRNQREHTALLKIEGVYARDETEFYLGKRCAYVYKAKNNTVTPGGKPNKTRVIWGKVTRAHGNSGMVRAKFRSNLPAKAIGHRIRVMLYPSRI,47,109,63,AYVYKAKNNTVTPGGKPNKTRVIWGKVTRAHGNSGMVRAKFRSNLPAKAIGHRIRVMLYPSRI,7030.898305,7035.30868,,,,,0
17371,RL35A_HUMAN,P18077,60S ribosomal protein L35a,P18077,,MSGRLWSKAIFAGYKRGLRNQREHTALLKIEGVYARDETEFYLGKRCAYVYKAKNNTVTPGGKPNKTRVIWGKVTRAHGNSGMVRAKFRSNLPAKAIGHRIRVMLYPSRI,0,109,110,MSGRLWSKAIFAGYKRGLRNQREHTALLKIEGVYARDETEFYLGKRCAYVYKAKNNTVTPGGKPNKTRVIWGKVTRAHGNSGMVRAKFRSNLPAKAIGHRIRVMLYPSRI,12571.78088,12579.71178,,RESID:55@7,,,0
19956,RL35A_HUMAN,P18077,60S ribosomal protein L35a,P18077,,MSGRLWSKAIFAGYKRGLRNQREHTALLKIEGVYARDETEFYLGKRCAYVYKAKNNTVTPGGKPNKTRVIWGKVTRAHGNSGMVRAKFRSNLPAKAIGHRIRVMLYPSRI,1,108,108,SGRLWSKAIFAGYKRGLRNQREHTALKIEGVYARDETEFYLGKRCAYVYKAKNNTVTPGGKPNKTRVIWGKVTRAHGNSGMVRAKFRSNLPAKAIGHRIRVMLYPSRI,12469.68294,12477.46978,,RESID:55@6|RESID:545@61,PSI-MOD:1458,,0
