PFR,UniProt Id,Entry Accession,Entry Description,Isoform Accession,Isoform Description,Isoform Sequence,Start,End,Length,Proteoform Sequence,Monoisotopic Mass,Average Mass,Sequence Modifications,PTMs,N-Terminal,C-Terminal,Star
8645,HMGN1_MOUSE,P18608,Non-histone chromosomal protein HMG-14,P18608,,MPKRKVSADGAAKAEPKRRSARLSAKPAPAKVDAKPKKAAGKDKASDKKVQIKGKRGAKGKQADVADQQTTELPAENGETENQSPASEEEKEAKSD,1,95,95,PKRKVSADGAAKAEPKRRSARLSAKPAPAKVDAKPKKAAGKDKASDKKVQIKGKRGAKGKQADVADQQTTELPAENGETENQSPASEEEKEAKSD,10015.33013469,10021.19948,,,,,1
8659,HMGN1_MOUSE,P18608,Non-histone chromosomal protein HMG-14,P18608,,MPKRKVSADGAAKAEPKRRSARLSAKPAPAKVDAKPKKAAGKDKASDKKVQIKGKRGAKGKQADVADQQTTELPAENGETENQSPASEEEKEAKSD,1,95,95,PKRKVSADGAAKAEPKRRSARLSAKPAPAKVDAKPKKAAGKDKASDKKVQIKGKRGAKGKQADVADQQTTELPAENGETENQSPASEEEKEAKSD,10095.29646569,10101.17948,,RESID:38@68,,,1
8683,HMGN1_MOUSE,P18608,Non-histone chromosomal protein HMG-14,P18608,,MPKRKVSADGAAKAEPKRRSARLSAKPAPAKVDAKPKKAAGKDKASDKKVQIKGKRGAKGKQADVADQQTTELPAENGETENQSPASEEEKEAKSD,1,95,95,PKRKVSADGAAKAEPKRRSARLSAKPAPAKVDAKPKKAAGKDKASDKKVQIKGKRGAKGKQADVADQQTTELPAENGETENQSPASEEEKEAKSD,10175.26279669,10181.15948,,RESID:38@68|RESID:38@78,,,1
8810,HMGN1_MOUSE,P18608,Non-histone chromosomal protein HMG-14,P18608,,MPKRKVSADGAAKAEPKRRSARLSAKPAPAKVDAKPKKAAGKDKASDKKVQIKGKRGAKGKQADVADQQTTELPAENGETENQSPASEEEKEAKSD,1,95,95,PKRKVSADGAAKAEPKRRSARLSAKPAPAKVDAKPKKAAGKDKASDKKVQIKGKRGAKGKQADVADQQTTELPAENGETENQSPASEEEKEAKSD,10095.29646569,10101.17948,,RESID:38@78,,,1
9197,HMGN1_MOUSE,P18608,Non-histone chromosomal protein HMG-14,P18608,,MPKRKVSADGAAKAEPKRRSARLSAKPAPAKVDAKPKKAAGKDKASDKKVQIKGKRGAKGKQADVADQQTTELPAENGETENQSPASEEEKEAKSD,1,95,95,PKRKVSADGAAKAEPKRRSARLSAKPAPAKVDAKPKKAAGKDKASDKKVQIKGKRGAKGKQADVADQQTTELPAENGETENQSPASEEEKEAKSD,10175.26279669,10181.15948,,RESID:38@68|RESID:37@82,,,1
9326,HMGN1_MOUSE,P18608,Non-histone chromosomal protein HMG-14,P18608,,MPKRKVSADGAAKAEPKRRSARLSAKPAPAKVDAKPKKAAGKDKASDKKVQIKGKRGAKGKQADVADQQTTELPAENGETENQSPASEEEKEAKSD,1,95,95,PKRKVSADGAAKAEPKRRSARLSAKPAPAKVDAKPKKAAGKDKASDKKVQIKGKRGAKGKQADVADQQTTELPAENGETENQSPASEEEKEAKSD,10175.26279669,10181.15948,,RESID:37@82|RESID:37@85,,,1
9767,HMGN1_MOUSE,P18608,Non-histone chromosomal protein HMG-14,P18608,,MPKRKVSADGAAKAEPKRRSARLSAKPAPAKVDAKPKKAAGKDKASDKKVQIKGKRGAKGKQADVADQQTTELPAENGETENQSPASEEEKEAKSD,1,95,95,PKRKVSADGAAKAEPKRRSARLSAKPAPAKVDAKPKKAAGKDKASDKKVQIKGKRGAKGKQADVADQQTTELPAENGETENQSPASEEEKEAKSD,10175.26279669,10181.15948,,RESID:38@78|RESID:37@82,,,1
10079,HMGN1_MOUSE,P18608,Non-histone chromosomal protein HMG-14,P18608,,MPKRKVSADGAAKAEPKRRSARLSAKPAPAKVDAKPKKAAGKDKASDKKVQIKGKRGAKGKQADVADQQTTELPAENGETENQSPASEEEKEAKSD,0,95,96,MPKRKVSADGAAKAEPKRRSARLSAKPAPAKVDAKPKKAAGKDKASDKKVQIKGKRGAKGKQADVADQQTTELPAENGETENQSPASEEEKEAKSD,10630.22340969,10636.37208,,RESID:49@0|RESID:37@6|RESID:55@12|RESID:37@19|RESID:37@23|RESID:38@69|RESID:38@79,,,1
10090,HMGN1_MOUSE,P18608,Non-histone chromosomal protein HMG-14,P18608,,MPKRKVSADGAAKAEPKRRSARLSAKPAPAKVDAKPKKAAGKDKASDKKVQIKGKRGAKGKQADVADQQTTELPAENGETENQSPASEEEKEAKSD,1,95,95,PKRKVSADGAAKAEPKRRSARLSAKPAPAKVDAKPKKAAGKDKASDKKVQIKGKRGAKGKQADVADQQTTELPAENGETENQSPASEEEKEAKSD,10335.19545869,10341.11948,,RESID:38@78|RESID:37@82|RESID:37@85|RESID:37@93,,,1
10371,HMGN1_MOUSE,P18608,Non-histone chromosomal protein HMG-14,P18608,,MPKRKVSADGAAKAEPKRRSARLSAKPAPAKVDAKPKKAAGKDKASDKKVQIKGKRGAKGKQADVADQQTTELPAENGETENQSPASEEEKEAKSD,1,95,95,PKRKVSADGAAKAEPKRRSARLSAKPAPAKVDAKPKKAAGKDKASDKKVQIKGKRGAKGKQADVADQQTTELPAENGETENQSPASEEEKEAKSD,10099.35126469,10105.27948,,RESID:50@0|RESID:55@11,,,1
10439,HMGN1_MOUSE,P18608,Non-histone chromosomal protein HMG-14,P18608,,MPKRKVSADGAAKAEPKRRSARLSAKPAPAKVDAKPKKAAGKDKASDKKVQIKGKRGAKGKQADVADQQTTELPAENGETENQSPASEEEKEAKSD,1,95,95,PKRKVSADGAAKAEPKRRSARLSAKPAPAKVDAKPKKAAGKDKASDKKVQIKGKRGAKGKQADVADQQTTELPAENGETENQSPASEEEKEAKSD,10175.26279669,10181.15948,,RESID:37@18|RESID:37@22,,,1
