PFR,UniProt Id,Entry Accession,Entry Description,Isoform Accession,Isoform Description,Isoform Sequence,Start,End,Length,Proteoform Sequence,Monoisotopic Mass,Average Mass,Sequence Modifications,PTMs,N-Terminal,C-Terminal,Star
9757,COF1_MOUSE,P18760,Cofilin-1,P18760,,MASGVAVSDGVIKVFNDMKVRKSSTPEEVKKRKKAVLFCLSEDKKNIILEEGKEILVGDVGQTVDDPYTTFVKMLPDKDCRYALYDATYETKESKKEDLVFIFWAPENAPLKSKMIYASSKDAIKKKLTGIKHELQANCYEEVKDRCTLAEKLGGSAVISLEGKPL,1,165,165,ASGVAVSDGVIKVFNDMKVRKSSTPEEVKKRKKAVLFCLSEDKKNIILEEGKEILVGDVGQTVDDPYTTFVKMLPDKDCRYALYDATYETKESKKEDLVFIFWAPENAPLKSKMIYASSKDAIKKKLTGIKHELQANCYEEVKDRCTLAEKLGGSAVISLEGKPL,18458.64896969,18470.39288,,RESID:41@0,,,1
10014,COF1_MOUSE,P18760,Cofilin-1,P18760,,MASGVAVSDGVIKVFNDMKVRKSSTPEEVKKRKKAVLFCLSEDKKNIILEEGKEILVGDVGQTVDDPYTTFVKMLPDKDCRYALYDATYETKESKKEDLVFIFWAPENAPLKSKMIYASSKDAIKKKLTGIKHELQANCYEEVKDRCTLAEKLGGSAVISLEGKPL,1,165,165,ASGVAVSDGVIKVFNDMKVRKSSTPEEVKKRKKAVLFCLSEDKKNIILEEGKEILVGDVGQTVDDPYTTFVKMLPDKDCRYALYDATYETKESKKEDLVFIFWAPENAPLKSKMIYASSKDAIKKKLTGIKHELQANCYEEVKDRCTLAEKLGGSAVISLEGKPL,18580.62586569,18592.41288,,RESID:37@6|RESID:55@11|RESID:55@17,,,1
10169,COF1_MOUSE,P18760,Cofilin-1,P18760,,MASGVAVSDGVIKVFNDMKVRKSSTPEEVKKRKKAVLFCLSEDKKNIILEEGKEILVGDVGQTVDDPYTTFVKMLPDKDCRYALYDATYETKESKKEDLVFIFWAPENAPLKSKMIYASSKDAIKKKLTGIKHELQANCYEEVKDRCTLAEKLGGSAVISLEGKPL,1,165,165,ASGVAVSDGVIKVFNDMKVRKSSTPEEVKKRKKAVLFCLSEDKKNIILEEGKEILVGDVGQTVDDPYTTFVKMLPDKDCRYALYDATYETKESKKEDLVFIFWAPENAPLKSKMIYASSKDAIKKKLTGIKHELQANCYEEVKDRCTLAEKLGGSAVISLEGKPL,18416.63840469,18428.35288,,,,,1
10274,COF1_MOUSE,P18760,Cofilin-1,P18760,,MASGVAVSDGVIKVFNDMKVRKSSTPEEVKKRKKAVLFCLSEDKKNIILEEGKEILVGDVGQTVDDPYTTFVKMLPDKDCRYALYDATYETKESKKEDLVFIFWAPENAPLKSKMIYASSKDAIKKKLTGIKHELQANCYEEVKDRCTLAEKLGGSAVISLEGKPL,0,165,166,MASGVAVSDGVIKVFNDMKVRKSSTPEEVKKRKKAVLFCLSEDKKNIILEEGKEILVGDVGQTVDDPYTTFVKMLPDKDCRYALYDATYETKESKKEDLVFIFWAPENAPLKSKMIYASSKDAIKKKLTGIKHELQANCYEEVKDRCTLAEKLGGSAVISLEGKPL,18589.68945969,18601.58548,,RESID:41@1,,,1
10301,COF1_MOUSE,P18760,Cofilin-1,P18760,,MASGVAVSDGVIKVFNDMKVRKSSTPEEVKKRKKAVLFCLSEDKKNIILEEGKEILVGDVGQTVDDPYTTFVKMLPDKDCRYALYDATYETKESKKEDLVFIFWAPENAPLKSKMIYASSKDAIKKKLTGIKHELQANCYEEVKDRCTLAEKLGGSAVISLEGKPL,1,165,165,ASGVAVSDGVIKVFNDMKVRKSSTPEEVKKRKKAVLFCLSEDKKNIILEEGKEILVGDVGQTVDDPYTTFVKMLPDKDCRYALYDATYETKESKKEDLVFIFWAPENAPLKSKMIYASSKDAIKKKLTGIKHELQANCYEEVKDRCTLAEKLGGSAVISLEGKPL,18618.58163169,18630.35288,,RESID:37@1|RESID:37@6|RESID:55@11,,,1
10344,COF1_MOUSE,P18760,Cofilin-1,P18760,,MASGVAVSDGVIKVFNDMKVRKSSTPEEVKKRKKAVLFCLSEDKKNIILEEGKEILVGDVGQTVDDPYTTFVKMLPDKDCRYALYDATYETKESKKEDLVFIFWAPENAPLKSKMIYASSKDAIKKKLTGIKHELQANCYEEVKDRCTLAEKLGGSAVISLEGKPL,1,165,165,ASGVAVSDGVIKVFNDMKVRKSSTPEEVKKRKKAVLFCLSEDKKNIILEEGKEILVGDVGQTVDDPYTTFVKMLPDKDCRYALYDATYETKESKKEDLVFIFWAPENAPLKSKMIYASSKDAIKKKLTGIKHELQANCYEEVKDRCTLAEKLGGSAVISLEGKPL,18538.61530069,18550.37288,,RESID:41@0|RESID:37@6,,,1
10356,COF1_MOUSE,P18760,Cofilin-1,P18760,,MASGVAVSDGVIKVFNDMKVRKSSTPEEVKKRKKAVLFCLSEDKKNIILEEGKEILVGDVGQTVDDPYTTFVKMLPDKDCRYALYDATYETKESKKEDLVFIFWAPENAPLKSKMIYASSKDAIKKKLTGIKHELQANCYEEVKDRCTLAEKLGGSAVISLEGKPL,1,165,165,ASGVAVSDGVIKVFNDMKVRKSSTPEEVKKRKKAVLFCLSEDKKNIILEEGKEILVGDVGQTVDDPYTTFVKMLPDKDCRYALYDATYETKESKKEDLVFIFWAPENAPLKSKMIYASSKDAIKKKLTGIKHELQANCYEEVKDRCTLAEKLGGSAVISLEGKPL,18702.60276169,18714.43288,,RESID:41@0|RESID:55@17|RESID:38@23|RESID:37@39|RESID:55@71,,,1
10462,COF1_MOUSE,P18760,Cofilin-1,P18760,,MASGVAVSDGVIKVFNDMKVRKSSTPEEVKKRKKAVLFCLSEDKKNIILEEGKEILVGDVGQTVDDPYTTFVKMLPDKDCRYALYDATYETKESKKEDLVFIFWAPENAPLKSKMIYASSKDAIKKKLTGIKHELQANCYEEVKDRCTLAEKLGGSAVISLEGKPL,0,165,166,MASGVAVSDGVIKVFNDMKVRKSSTPEEVKKRKKAVLFCLSEDKKNIILEEGKEILVGDVGQTVDDPYTTFVKMLPDKDCRYALYDATYETKESKKEDLVFIFWAPENAPLKSKMIYASSKDAIKKKLTGIKHELQANCYEEVKDRCTLAEKLGGSAVISLEGKPL,18547.67889469,18559.54548,,,,,1
10543,COF1_MOUSE,P18760,Cofilin-1,P18760,,MASGVAVSDGVIKVFNDMKVRKSSTPEEVKKRKKAVLFCLSEDKKNIILEEGKEILVGDVGQTVDDPYTTFVKMLPDKDCRYALYDATYETKESKKEDLVFIFWAPENAPLKSKMIYASSKDAIKKKLTGIKHELQANCYEEVKDRCTLAEKLGGSAVISLEGKPL,1,165,165,ASGVAVSDGVIKVFNDMKVRKSSTPEEVKKRKKAVLFCLSEDKKNIILEEGKEILVGDVGQTVDDPYTTFVKMLPDKDCRYALYDATYETKESKKEDLVFIFWAPENAPLKSKMIYASSKDAIKKKLTGIKHELQANCYEEVKDRCTLAEKLGGSAVISLEGKPL,18458.64896969,18470.39288,,RESID:55@71,,,1
