PFR,UniProt Id,Entry Accession,Entry Description,Isoform Accession,Isoform Description,Isoform Sequence,Start,End,Length,Proteoform Sequence,Monoisotopic Mass,Average Mass,Sequence Modifications,PTMs,N-Terminal,C-Terminal,Star
8647,GSTP1_MOUSE,P19157,Glutathione S-transferase P 1,P19157,,MPPYTIVYFPVRGRCEAMRMLLADQGQSWKEEVVTIDTWMQGLLKPTCLYGQLPKFEDGDLTLYQSNAILRHLGRSLGLYGKNQREAAQMDMVNDGVEDLRGKYVTLIYTNYENGKNDYVKALPGHLKPFETLLSQNQGGKAFIVGDQISFADYNLLDLLLIHQVLAPGCLDNFPLLSAYVARLSARPKIKAFLSSPEHVNRPINGNGKQ,1,209,209,PPYTIVYFPVRGRCEAMRMLLADQGQSWKEEVVTIDTWMQGLLKPTCLYGQLPKFEDGDLTLYQSNAILRHLGRSLGLYGKNQREAAQMDMVNDGVEDLRGKYVTLIYTNYENGKNDYVKALPGHLKPFETLLSQNQGGKAFIVGDQISFADYNLLDLLLIHQVLAPGCLDNFPLLSAYVARLSARPKIKAFLSSPEHVNRPINGNGKQ,23463.07241469,23477.99058,,,,,1
8661,GSTP1_MOUSE,P19157,Glutathione S-transferase P 1,P19157,,MPPYTIVYFPVRGRCEAMRMLLADQGQSWKEEVVTIDTWMQGLLKPTCLYGQLPKFEDGDLTLYQSNAILRHLGRSLGLYGKNQREAAQMDMVNDGVEDLRGKYVTLIYTNYENGKNDYVKALPGHLKPFETLLSQNQGGKAFIVGDQISFADYNLLDLLLIHQVLAPGCLDNFPLLSAYVARLSARPKIKAFLSSPEHVNRPINGNGKQ,1,209,209,PPYTIVYFPVRGRCEAMRMLLADQGQSWKEEVVTIDTWMQGLLKPTCLYGQLPKFEDGDLTLYQSNAILRHLGRSLGLYGKNQREAAQMDMVNDGVEDLRGKYVTLIYTNYENGKNDYVKALPGHLKPFETLLSQNQGGKAFIVGDQISFADYNLLDLLLIHQVLAPGCLDNFPLLSAYVARLSARPKIKAFLSSPEHVNRPINGNGKQ,23543.03874569,23557.97058,,RESID:39@107,,,1
8671,GSTP1_MOUSE,P19157,Glutathione S-transferase P 1,P19157,,MPPYTIVYFPVRGRCEAMRMLLADQGQSWKEEVVTIDTWMQGLLKPTCLYGQLPKFEDGDLTLYQSNAILRHLGRSLGLYGKNQREAAQMDMVNDGVEDLRGKYVTLIYTNYENGKNDYVKALPGHLKPFETLLSQNQGGKAFIVGDQISFADYNLLDLLLIHQVLAPGCLDNFPLLSAYVARLSARPKIKAFLSSPEHVNRPINGNGKQ,1,209,209,PPYTIVYFPVRGRCEAMRMLLADQGQSWKEEVVTIDTWMQGLLKPTCLYGQLPKFEDGDLTLYQSNAILRHLGRSLGLYGKNQREAAQMDMVNDGVEDLRGKYVTLIYTNYENGKNDYVKALPGHLKPFETLLSQNQGGKAFIVGDQISFADYNLLDLLLIHQVLAPGCLDNFPLLSAYVARLSARPKIKAFLSSPEHVNRPINGNGKQ,23547.09354469,23562.07058,,RESID:55@119|RESID:55@126,,,1
8680,GSTP1_MOUSE,P19157,Glutathione S-transferase P 1,P19157,,MPPYTIVYFPVRGRCEAMRMLLADQGQSWKEEVVTIDTWMQGLLKPTCLYGQLPKFEDGDLTLYQSNAILRHLGRSLGLYGKNQREAAQMDMVNDGVEDLRGKYVTLIYTNYENGKNDYVKALPGHLKPFETLLSQNQGGKAFIVGDQISFADYNLLDLLLIHQVLAPGCLDNFPLLSAYVARLSARPKIKAFLSSPEHVNRPINGNGKQ,1,209,209,PPYTIVYFPVRGRCEAMRMLLADQGQSWKEEVVTIDTWMQGLLKPTCLYGQLPKFEDGDLTLYQSNAILRHLGRSLGLYGKNQREAAQMDMVNDGVEDLRGKYVTLIYTNYENGKNDYVKALPGHLKPFETLLSQNQGGKAFIVGDQISFADYNLLDLLLIHQVLAPGCLDNFPLLSAYVARLSARPKIKAFLSSPEHVNRPINGNGKQ,23585.04931069,23600.01058,,RESID:39@107|RESID:55@119,,,1
8689,GSTP1_MOUSE,P19157,Glutathione S-transferase P 1,P19157,,MPPYTIVYFPVRGRCEAMRMLLADQGQSWKEEVVTIDTWMQGLLKPTCLYGQLPKFEDGDLTLYQSNAILRHLGRSLGLYGKNQREAAQMDMVNDGVEDLRGKYVTLIYTNYENGKNDYVKALPGHLKPFETLLSQNQGGKAFIVGDQISFADYNLLDLLLIHQVLAPGCLDNFPLLSAYVARLSARPKIKAFLSSPEHVNRPINGNGKQ,1,209,209,PPYTIVYFPVRGRCEAMRMLLADQGQSWKEEVVTIDTWMQGLLKPTCLYGQLPKFEDGDLTLYQSNAILRHLGRSLGLYGKNQREAAQMDMVNDGVEDLRGKYVTLIYTNYENGKNDYVKALPGHLKPFETLLSQNQGGKAFIVGDQISFADYNLLDLLLIHQVLAPGCLDNFPLLSAYVARLSARPKIKAFLSSPEHVNRPINGNGKQ,23627.05987569,23642.05058,,RESID:39@107|RESID:55@119|RESID:55@126,,,1
8709,GSTP1_MOUSE,P19157,Glutathione S-transferase P 1,P19157,,MPPYTIVYFPVRGRCEAMRMLLADQGQSWKEEVVTIDTWMQGLLKPTCLYGQLPKFEDGDLTLYQSNAILRHLGRSLGLYGKNQREAAQMDMVNDGVEDLRGKYVTLIYTNYENGKNDYVKALPGHLKPFETLLSQNQGGKAFIVGDQISFADYNLLDLLLIHQVLAPGCLDNFPLLSAYVARLSARPKIKAFLSSPEHVNRPINGNGKQ,0,209,210,MPPYTIVYFPVRGRCEAMRMLLADQGQSWKEEVVTIDTWMQGLLKPTCLYGQLPKFEDGDLTLYQSNAILRHLGRSLGLYGKNQREAAQMDMVNDGVEDLRGKYVTLIYTNYENGKNDYVKALPGHLKPFETLLSQNQGGKAFIVGDQISFADYNLLDLLLIHQVLAPGCLDNFPLLSAYVARLSARPKIKAFLSSPEHVNRPINGNGKQ,23594.11290469,23609.18318,,,,,1
8722,GSTP1_MOUSE,P19157,Glutathione S-transferase P 1,P19157,,MPPYTIVYFPVRGRCEAMRMLLADQGQSWKEEVVTIDTWMQGLLKPTCLYGQLPKFEDGDLTLYQSNAILRHLGRSLGLYGKNQREAAQMDMVNDGVEDLRGKYVTLIYTNYENGKNDYVKALPGHLKPFETLLSQNQGGKAFIVGDQISFADYNLLDLLLIHQVLAPGCLDNFPLLSAYVARLSARPKIKAFLSSPEHVNRPINGNGKQ,0,209,210,MPPYTIVYFPVRGRCEAMRMLLADQGQSWKEEVVTIDTWMQGLLKPTCLYGQLPKFEDGDLTLYQSNAILRHLGRSLGLYGKNQREAAQMDMVNDGVEDLRGKYVTLIYTNYENGKNDYVKALPGHLKPFETLLSQNQGGKAFIVGDQISFADYNLLDLLLIHQVLAPGCLDNFPLLSAYVARLSARPKIKAFLSSPEHVNRPINGNGKQ,23880.07726169,23895.26318,,RESID:49@0|RESID:39@7|RESID:39@108|RESID:55@120|RESID:55@127,,,1
8725,GSTP1_MOUSE,P19157,Glutathione S-transferase P 1,P19157,,MPPYTIVYFPVRGRCEAMRMLLADQGQSWKEEVVTIDTWMQGLLKPTCLYGQLPKFEDGDLTLYQSNAILRHLGRSLGLYGKNQREAAQMDMVNDGVEDLRGKYVTLIYTNYENGKNDYVKALPGHLKPFETLLSQNQGGKAFIVGDQISFADYNLLDLLLIHQVLAPGCLDNFPLLSAYVARLSARPKIKAFLSSPEHVNRPINGNGKQ,0,209,210,MPPYTIVYFPVRGRCEAMRMLLADQGQSWKEEVVTIDTWMQGLLKPTCLYGQLPKFEDGDLTLYQSNAILRHLGRSLGLYGKNQREAAQMDMVNDGVEDLRGKYVTLIYTNYENGKNDYVKALPGHLKPFETLLSQNQGGKAFIVGDQISFADYNLLDLLLIHQVLAPGCLDNFPLLSAYVARLSARPKIKAFLSSPEHVNRPINGNGKQ,23754.04556669,23769.14318,,RESID:39@7|RESID:39@108,,,1
8767,GSTP1_MOUSE,P19157,Glutathione S-transferase P 1,P19157,,MPPYTIVYFPVRGRCEAMRMLLADQGQSWKEEVVTIDTWMQGLLKPTCLYGQLPKFEDGDLTLYQSNAILRHLGRSLGLYGKNQREAAQMDMVNDGVEDLRGKYVTLIYTNYENGKNDYVKALPGHLKPFETLLSQNQGGKAFIVGDQISFADYNLLDLLLIHQVLAPGCLDNFPLLSAYVARLSARPKIKAFLSSPEHVNRPINGNGKQ,1,209,209,PPYTIVYFPVRGRCEAMRMLLADQGQSWKEEVVTIDTWMQGLLKPTCLYGQLPKFEDGDLTLYQSNAILRHLGRSLGLYGKNQREAAQMDMVNDGVEDLRGKYVTLIYTNYENGKNDYVKALPGHLKPFETLLSQNQGGKAFIVGDQISFADYNLLDLLLIHQVLAPGCLDNFPLLSAYVARLSARPKIKAFLSSPEHVNRPINGNGKQ,23589.10410969,23604.11058,,RESID:50@0|RESID:55@119|RESID:55@126,,,1
9320,GSTP1_MOUSE,P19157,Glutathione S-transferase P 1,P19157,,MPPYTIVYFPVRGRCEAMRMLLADQGQSWKEEVVTIDTWMQGLLKPTCLYGQLPKFEDGDLTLYQSNAILRHLGRSLGLYGKNQREAAQMDMVNDGVEDLRGKYVTLIYTNYENGKNDYVKALPGHLKPFETLLSQNQGGKAFIVGDQISFADYNLLDLLLIHQVLAPGCLDNFPLLSAYVARLSARPKIKAFLSSPEHVNRPINGNGKQ,0,209,210,MPPYTIVYFPVRGRCEAMRMLLADQGQSWKEEVVTIDTWMQGLLKPTCLYGQLPKFEDGDLTLYQSNAILRHLGRSLGLYGKNQREAAQMDMVNDGVEDLRGKYVTLIYTNYENGKNDYVKALPGHLKPFETLLSQNQGGKAFIVGDQISFADYNLLDLLLIHQVLAPGCLDNFPLLSAYVARLSARPKIKAFLSSPEHVNRPINGNGKQ,23636.12346969,23651.22318,,RESID:49@0,,,1
9367,GSTP1_MOUSE,P19157,Glutathione S-transferase P 1,P19157,,MPPYTIVYFPVRGRCEAMRMLLADQGQSWKEEVVTIDTWMQGLLKPTCLYGQLPKFEDGDLTLYQSNAILRHLGRSLGLYGKNQREAAQMDMVNDGVEDLRGKYVTLIYTNYENGKNDYVKALPGHLKPFETLLSQNQGGKAFIVGDQISFADYNLLDLLLIHQVLAPGCLDNFPLLSAYVARLSARPKIKAFLSSPEHVNRPINGNGKQ,1,209,209,PPYTIVYFPVRGRCEAMRMLLADQGQSWKEEVVTIDTWMQGLLKPTCLYGQLPKFEDGDLTLYQSNAILRHLGRSLGLYGKNQREAAQMDMVNDGVEDLRGKYVTLIYTNYENGKNDYVKALPGHLKPFETLLSQNQGGKAFIVGDQISFADYNLLDLLLIHQVLAPGCLDNFPLLSAYVARLSARPKIKAFLSSPEHVNRPINGNGKQ,23505.08297969,23520.03058,,RESID:55@119,,,1
9440,GSTP1_MOUSE,P19157,Glutathione S-transferase P 1,P19157,,MPPYTIVYFPVRGRCEAMRMLLADQGQSWKEEVVTIDTWMQGLLKPTCLYGQLPKFEDGDLTLYQSNAILRHLGRSLGLYGKNQREAAQMDMVNDGVEDLRGKYVTLIYTNYENGKNDYVKALPGHLKPFETLLSQNQGGKAFIVGDQISFADYNLLDLLLIHQVLAPGCLDNFPLLSAYVARLSARPKIKAFLSSPEHVNRPINGNGKQ,0,209,210,MPPYTIVYFPVRGRCEAMRMLLADQGQSWKEEVVTIDTWMQGLLKPTCLYGQLPKFEDGDLTLYQSNAILRHLGRSLGLYGKNQREAAQMDMVNDGVEDLRGKYVTLIYTNYENGKNDYVKALPGHLKPFETLLSQNQGGKAFIVGDQISFADYNLLDLLLIHQVLAPGCLDNFPLLSAYVARLSARPKIKAFLSSPEHVNRPINGNGKQ,23800.11093069,23815.28318,,RESID:49@0|RESID:39@108|RESID:55@120|RESID:55@127,,,1
9463,GSTP1_MOUSE,P19157,Glutathione S-transferase P 1,P19157,,MPPYTIVYFPVRGRCEAMRMLLADQGQSWKEEVVTIDTWMQGLLKPTCLYGQLPKFEDGDLTLYQSNAILRHLGRSLGLYGKNQREAAQMDMVNDGVEDLRGKYVTLIYTNYENGKNDYVKALPGHLKPFETLLSQNQGGKAFIVGDQISFADYNLLDLLLIHQVLAPGCLDNFPLLSAYVARLSARPKIKAFLSSPEHVNRPINGNGKQ,1,209,209,PPYTIVYFPVRGRCEAMRMLLADQGQSWKEEVVTIDTWMQGLLKPTCLYGQLPKFEDGDLTLYQSNAILRHLGRSLGLYGKNQREAAQMDMVNDGVEDLRGKYVTLIYTNYENGKNDYVKALPGHLKPFETLLSQNQGGKAFIVGDQISFADYNLLDLLLIHQVLAPGCLDNFPLLSAYVARLSARPKIKAFLSSPEHVNRPINGNGKQ,23505.08297969,23520.03058,,RESID:50@0,,,1
9521,GSTP1_MOUSE,P19157,Glutathione S-transferase P 1,P19157,,MPPYTIVYFPVRGRCEAMRMLLADQGQSWKEEVVTIDTWMQGLLKPTCLYGQLPKFEDGDLTLYQSNAILRHLGRSLGLYGKNQREAAQMDMVNDGVEDLRGKYVTLIYTNYENGKNDYVKALPGHLKPFETLLSQNQGGKAFIVGDQISFADYNLLDLLLIHQVLAPGCLDNFPLLSAYVARLSARPKIKAFLSSPEHVNRPINGNGKQ,0,209,210,MPPYTIVYFPVRGRCEAMRMLLADQGQSWKEEVVTIDTWMQGLLKPTCLYGQLPKFEDGDLTLYQSNAILRHLGRSLGLYGKNQREAAQMDMVNDGVEDLRGKYVTLIYTNYENGKNDYVKALPGHLKPFETLLSQNQGGKAFIVGDQISFADYNLLDLLLIHQVLAPGCLDNFPLLSAYVARLSARPKIKAFLSSPEHVNRPINGNGKQ,23716.08980069,23731.20318,,RESID:49@0|RESID:39@7,,,1
9531,GSTP1_MOUSE,P19157,Glutathione S-transferase P 1,P19157,,MPPYTIVYFPVRGRCEAMRMLLADQGQSWKEEVVTIDTWMQGLLKPTCLYGQLPKFEDGDLTLYQSNAILRHLGRSLGLYGKNQREAAQMDMVNDGVEDLRGKYVTLIYTNYENGKNDYVKALPGHLKPFETLLSQNQGGKAFIVGDQISFADYNLLDLLLIHQVLAPGCLDNFPLLSAYVARLSARPKIKAFLSSPEHVNRPINGNGKQ,0,209,210,MPPYTIVYFPVRGRCEAMRMLLADQGQSWKEEVVTIDTWMQGLLKPTCLYGQLPKFEDGDLTLYQSNAILRHLGRSLGLYGKNQREAAQMDMVNDGVEDLRGKYVTLIYTNYENGKNDYVKALPGHLKPFETLLSQNQGGKAFIVGDQISFADYNLLDLLLIHQVLAPGCLDNFPLLSAYVARLSARPKIKAFLSSPEHVNRPINGNGKQ,23678.13403469,23693.26318,,RESID:49@0|RESID:55@120,,,1
9601,GSTP1_MOUSE,P19157,Glutathione S-transferase P 1,P19157,,MPPYTIVYFPVRGRCEAMRMLLADQGQSWKEEVVTIDTWMQGLLKPTCLYGQLPKFEDGDLTLYQSNAILRHLGRSLGLYGKNQREAAQMDMVNDGVEDLRGKYVTLIYTNYENGKNDYVKALPGHLKPFETLLSQNQGGKAFIVGDQISFADYNLLDLLLIHQVLAPGCLDNFPLLSAYVARLSARPKIKAFLSSPEHVNRPINGNGKQ,1,209,209,PPYTIVYFPVRGRCEAMRMLLADQGQSWKEEVVTIDTWMQGLLKPTCLYGQLPKFEDGDLTLYQSNAILRHLGRSLGLYGKNQREAAQMDMVNDGVEDLRGKYVTLIYTNYENGKNDYVKALPGHLKPFETLLSQNQGGKAFIVGDQISFADYNLLDLLLIHQVLAPGCLDNFPLLSAYVARLSARPKIKAFLSSPEHVNRPINGNGKQ,23669.07044069,23684.09058,,RESID:50@0|RESID:39@6|RESID:55@119|RESID:55@126,,,1
9705,GSTP1_MOUSE,P19157,Glutathione S-transferase P 1,P19157,,MPPYTIVYFPVRGRCEAMRMLLADQGQSWKEEVVTIDTWMQGLLKPTCLYGQLPKFEDGDLTLYQSNAILRHLGRSLGLYGKNQREAAQMDMVNDGVEDLRGKYVTLIYTNYENGKNDYVKALPGHLKPFETLLSQNQGGKAFIVGDQISFADYNLLDLLLIHQVLAPGCLDNFPLLSAYVARLSARPKIKAFLSSPEHVNRPINGNGKQ,1,209,209,PPYTIVYFPVRGRCEAMRMLLADQGQSWKEEVVTIDTWMQGLLKPTCLYGQLPKFEDGDLTLYQSNAILRHLGRSLGLYGKNQREAAQMDMVNDGVEDLRGKYVTLIYTNYENGKNDYVKALPGHLKPFETLLSQNQGGKAFIVGDQISFADYNLLDLLLIHQVLAPGCLDNFPLLSAYVARLSARPKIKAFLSSPEHVNRPINGNGKQ,23707.02620669,23722.03058,,RESID:50@0|RESID:39@6|RESID:39@107|RESID:55@119,,,1
9780,GSTP1_MOUSE,P19157,Glutathione S-transferase P 1,P19157,,MPPYTIVYFPVRGRCEAMRMLLADQGQSWKEEVVTIDTWMQGLLKPTCLYGQLPKFEDGDLTLYQSNAILRHLGRSLGLYGKNQREAAQMDMVNDGVEDLRGKYVTLIYTNYENGKNDYVKALPGHLKPFETLLSQNQGGKAFIVGDQISFADYNLLDLLLIHQVLAPGCLDNFPLLSAYVARLSARPKIKAFLSSPEHVNRPINGNGKQ,0,209,210,MPPYTIVYFPVRGRCEAMRMLLADQGQSWKEEVVTIDTWMQGLLKPTCLYGQLPKFEDGDLTLYQSNAILRHLGRSLGLYGKNQREAAQMDMVNDGVEDLRGKYVTLIYTNYENGKNDYVKALPGHLKPFETLLSQNQGGKAFIVGDQISFADYNLLDLLLIHQVLAPGCLDNFPLLSAYVARLSARPKIKAFLSSPEHVNRPINGNGKQ,23636.12346969,23651.22318,,RESID:55@120,,,1
9835,GSTP1_MOUSE,P19157,Glutathione S-transferase P 1,P19157,,MPPYTIVYFPVRGRCEAMRMLLADQGQSWKEEVVTIDTWMQGLLKPTCLYGQLPKFEDGDLTLYQSNAILRHLGRSLGLYGKNQREAAQMDMVNDGVEDLRGKYVTLIYTNYENGKNDYVKALPGHLKPFETLLSQNQGGKAFIVGDQISFADYNLLDLLLIHQVLAPGCLDNFPLLSAYVARLSARPKIKAFLSSPEHVNRPINGNGKQ,0,209,210,MPPYTIVYFPVRGRCEAMRMLLADQGQSWKEEVVTIDTWMQGLLKPTCLYGQLPKFEDGDLTLYQSNAILRHLGRSLGLYGKNQREAAQMDMVNDGVEDLRGKYVTLIYTNYENGKNDYVKALPGHLKPFETLLSQNQGGKAFIVGDQISFADYNLLDLLLIHQVLAPGCLDNFPLLSAYVARLSARPKIKAFLSSPEHVNRPINGNGKQ,23758.10036569,23773.24318,,RESID:49@0|RESID:39@108|RESID:55@120,,,1
10046,GSTP1_MOUSE,P19157,Glutathione S-transferase P 1,P19157,,MPPYTIVYFPVRGRCEAMRMLLADQGQSWKEEVVTIDTWMQGLLKPTCLYGQLPKFEDGDLTLYQSNAILRHLGRSLGLYGKNQREAAQMDMVNDGVEDLRGKYVTLIYTNYENGKNDYVKALPGHLKPFETLLSQNQGGKAFIVGDQISFADYNLLDLLLIHQVLAPGCLDNFPLLSAYVARLSARPKIKAFLSSPEHVNRPINGNGKQ,0,209,210,MPPYTIVYFPVRGRCEAMRMLLADQGQSWKEEVVTIDTWMQGLLKPTCLYGQLPKFEDGDLTLYQSNAILRHLGRSLGLYGKNQREAAQMDMVNDGVEDLRGKYVTLIYTNYENGKNDYVKALPGHLKPFETLLSQNQGGKAFIVGDQISFADYNLLDLLLIHQVLAPGCLDNFPLLSAYVARLSARPKIKAFLSSPEHVNRPINGNGKQ,23674.07923569,23689.16318,,RESID:39@108,,,1
10053,GSTP1_MOUSE,P19157,Glutathione S-transferase P 1,P19157,,MPPYTIVYFPVRGRCEAMRMLLADQGQSWKEEVVTIDTWMQGLLKPTCLYGQLPKFEDGDLTLYQSNAILRHLGRSLGLYGKNQREAAQMDMVNDGVEDLRGKYVTLIYTNYENGKNDYVKALPGHLKPFETLLSQNQGGKAFIVGDQISFADYNLLDLLLIHQVLAPGCLDNFPLLSAYVARLSARPKIKAFLSSPEHVNRPINGNGKQ,0,209,210,MPPYTIVYFPVRGRCEAMRMLLADQGQSWKEEVVTIDTWMQGLLKPTCLYGQLPKFEDGDLTLYQSNAILRHLGRSLGLYGKNQREAAQMDMVNDGVEDLRGKYVTLIYTNYENGKNDYVKALPGHLKPFETLLSQNQGGKAFIVGDQISFADYNLLDLLLIHQVLAPGCLDNFPLLSAYVARLSARPKIKAFLSSPEHVNRPINGNGKQ,23758.10036569,23773.24318,,RESID:39@108|RESID:55@120|RESID:55@127,,,1
10056,GSTP1_MOUSE,P19157,Glutathione S-transferase P 1,P19157,,MPPYTIVYFPVRGRCEAMRMLLADQGQSWKEEVVTIDTWMQGLLKPTCLYGQLPKFEDGDLTLYQSNAILRHLGRSLGLYGKNQREAAQMDMVNDGVEDLRGKYVTLIYTNYENGKNDYVKALPGHLKPFETLLSQNQGGKAFIVGDQISFADYNLLDLLLIHQVLAPGCLDNFPLLSAYVARLSARPKIKAFLSSPEHVNRPINGNGKQ,1,209,209,PPYTIVYFPVRGRCEAMRMLLADQGQSWKEEVVTIDTWMQGLLKPTCLYGQLPKFEDGDLTLYQSNAILRHLGRSLGLYGKNQREAAQMDMVNDGVEDLRGKYVTLIYTNYENGKNDYVKALPGHLKPFETLLSQNQGGKAFIVGDQISFADYNLLDLLLIHQVLAPGCLDNFPLLSAYVARLSARPKIKAFLSSPEHVNRPINGNGKQ,23585.04931069,23600.01058,,RESID:50@0|RESID:39@6,,,1
10083,GSTP1_MOUSE,P19157,Glutathione S-transferase P 1,P19157,,MPPYTIVYFPVRGRCEAMRMLLADQGQSWKEEVVTIDTWMQGLLKPTCLYGQLPKFEDGDLTLYQSNAILRHLGRSLGLYGKNQREAAQMDMVNDGVEDLRGKYVTLIYTNYENGKNDYVKALPGHLKPFETLLSQNQGGKAFIVGDQISFADYNLLDLLLIHQVLAPGCLDNFPLLSAYVARLSARPKIKAFLSSPEHVNRPINGNGKQ,1,209,209,PPYTIVYFPVRGRCEAMRMLLADQGQSWKEEVVTIDTWMQGLLKPTCLYGQLPKFEDGDLTLYQSNAILRHLGRSLGLYGKNQREAAQMDMVNDGVEDLRGKYVTLIYTNYENGKNDYVKALPGHLKPFETLLSQNQGGKAFIVGDQISFADYNLLDLLLIHQVLAPGCLDNFPLLSAYVARLSARPKIKAFLSSPEHVNRPINGNGKQ,23627.05987569,23642.05058,,RESID:39@6|RESID:55@119|RESID:55@126,,,1
10438,GSTP1_MOUSE,P19157,Glutathione S-transferase P 1,P19157,,MPPYTIVYFPVRGRCEAMRMLLADQGQSWKEEVVTIDTWMQGLLKPTCLYGQLPKFEDGDLTLYQSNAILRHLGRSLGLYGKNQREAAQMDMVNDGVEDLRGKYVTLIYTNYENGKNDYVKALPGHLKPFETLLSQNQGGKAFIVGDQISFADYNLLDLLLIHQVLAPGCLDNFPLLSAYVARLSARPKIKAFLSSPEHVNRPINGNGKQ,0,209,210,MPPYTIVYFPVRGRCEAMRMLLADQGQSWKEEVVTIDTWMQGLLKPTCLYGQLPKFEDGDLTLYQSNAILRHLGRSLGLYGKNQREAAQMDMVNDGVEDLRGKYVTLIYTNYENGKNDYVKALPGHLKPFETLLSQNQGGKAFIVGDQISFADYNLLDLLLIHQVLAPGCLDNFPLLSAYVARLSARPKIKAFLSSPEHVNRPINGNGKQ,23674.07923569,23689.16318,,RESID:39@7,,,1
