PFR,UniProt Id,Entry Accession,Entry Description,Isoform Accession,Isoform Description,Isoform Sequence,Start,End,Length,Proteoform Sequence,Monoisotopic Mass,Average Mass,Sequence Modifications,PTMs,N-Terminal,C-Terminal,Star
1026,PTMS_HUMAN,P20962,Parathymosin,P20962,,MSEKSVEAAAELSAKDLKEKKEKVEEKASRKERKKEVVEEEENGAEEEEEETAEDGEEEDEGEEEDEEEEEEDDEGPALKRAAEEEDEADPKRQKTENGASA,1,101,101,SEKSVEAAAELSAKDLKEKKEKVEEKASRKERKKEVVEEEENGAEEEEEETAEDGEEEDEGEEEDEEEEEEDDEGPALKRAAEEEDEADPKRQKTENGASA,11434.15759969,11440.74728,,RESID:51@0,,,3
1408,PTMS_HUMAN,P20962,Parathymosin,P20962,,MSEKSVEAAAELSAKDLKEKKEKVEEKASRKERKKEVVEEEENGAEEEEEETAEDGEEEDEGEEEDEEEEEEDDEGPALKRAAEEEDEADPKRQKTENGASA,1,101,101,SEKSVEAAAELSAKDLKEKKEKVEEKASRKERKKEVVEEEENGAEEEEEETAEDGEEEDEGEEEDEEEEEEDDEGPALKRAAEEEDEADPKRQKTENGASA,11476.16816469,11482.78728,,RESID:51@0|RESID:55@90,,,1
6973,PTMS_HUMAN,P20962,Parathymosin,P20962,,MSEKSVEAAAELSAKDLKEKKEKVEEKASRKERKKEVVEEEENGAEEEEEETAEDGEEEDEGEEEDEEEEEEDDEGPALKRAAEEEDEADPKRQKTENGASA,1,101,101,SEKSVEAAAELSAKDLKEKKEKVEEKASRKERKKEVVEEEENGAEEEEEETAEDGEEEDEGEEEDEEEEEEDDEGPALKRAAEEEDEADPKRQKTENGASA,11434.15759969,11440.74728,,RESID:55@2,,,1
7471,PTMS_HUMAN,P20962,Parathymosin,P20962,,MSEKSVEAAAELSAKDLKEKKEKVEEKASRKERKKEVVEEEENGAEEEEEETAEDGEEEDEGEEEDEEEEEEDDEGPALKRAAEEEDEADPKRQKTENGASA,0,101,102,MSEKSVEAAAELSAKDLKEKKEKVEEKASRKERKKEVVEEEENGAEEEEEETAEDGEEEDEGEEEDEEEEEEDDEGPALKRAAEEEDEADPKRQKTENGASA,11565.19808969,11571.93988,,RESID:49@0,,,1
12842,PTMS_HUMAN,P20962,Parathymosin,P20962,,MSEKSVEAAAELSAKDLKEKKEKVEEKASRKERKKEVVEEEENGAEEEEEETAEDGEEEDEGEEEDEEEEEEDDEGPALKRAAEEEDEADPKRQKTENGASA,1,101,101,SEKSVEAAAELSAKDLKEKKEKVEEKASRKERKKEVVEEEENGAEEEEEETAEDGEEEDEGEEEDEEEEEEDDEGPALKRAAEEEDEADPKRQKTENGASA,11392.14703469,11398.70728,,,,,1
13432,PTMS_HUMAN,P20962,Parathymosin,P20962,,MSEKSVEAAAELSAKDLKEKKEKVEEKASRKERKKEVVEEEENGAEEEEEETAEDGEEEDEGEEEDEEEEEEDDEGPALKRAAEEEDEADPKRQKTENGASA,1,101,101,SEKSVEAAAELSAKDLKEKKEKVEEKASRKERKKEVVEEEENGAEEEEEETAEDGEEEDEGEEEDEEEEEEDDEGPALKRAAEEEDEADPKRQKTENGASA,11514.12393069,11520.72728,,RESID:55@2|RESID:37@3,,,1
13587,PTMS_HUMAN,P20962,Parathymosin,P20962,,MSEKSVEAAAELSAKDLKEKKEKVEEKASRKERKKEVVEEEENGAEEEEEETAEDGEEEDEGEEEDEEEEEEDDEGPALKRAAEEEDEADPKRQKTENGASA,1,101,101,SEKSVEAAAELSAKDLKEKKEKVEEKASRKERKKEVVEEEENGAEEEEEETAEDGEEEDEGEEEDEEEEEEDDEGPALKRAAEEEDEADPKRQKTENGASA,11514.12393069,11520.72728,,RESID:51@0|RESID:37@3,,,1
13647,PTMS_HUMAN,P20962,Parathymosin,P20962,,MSEKSVEAAAELSAKDLKEKKEKVEEKASRKERKKEVVEEEENGAEEEEEETAEDGEEEDEGEEEDEEEEEEDDEGPALKRAAEEEDEADPKRQKTENGASA,1,101,101,SEKSVEAAAELSAKDLKEKKEKVEEKASRKERKKEVVEEEENGAEEEEEETAEDGEEEDEGEEEDEEEEEEDDEGPALKRAAEEEDEADPKRQKTENGASA,11472.11336569,11478.68728,,RESID:37@3,,,1
13816,PTMS_HUMAN,P20962,Parathymosin,P20962,,MSEKSVEAAAELSAKDLKEKKEKVEEKASRKERKKEVVEEEENGAEEEEEETAEDGEEEDEGEEEDEEEEEEDDEGPALKRAAEEEDEADPKRQKTENGASA,1,101,101,SEKSVEAAAELSAKDLKEKKEKVEEKASRKERKKEVVEEEENGAEEEEEETAEDGEEEDEGEEEDEEEEEEDDEGPALKRAAEEEDEADPKRQKTENGASA,11518.17872969,11524.82728,,RESID:51@0|RESID:55@2|RESID:55@13,,,1
14473,PTMS_HUMAN,P20962,Parathymosin,P20962,,MSEKSVEAAAELSAKDLKEKKEKVEEKASRKERKKEVVEEEENGAEEEEEETAEDGEEEDEGEEEDEEEEEEDDEGPALKRAAEEEDEADPKRQKTENGASA,1,101,101,SEKSVEAAAELSAKDLKEKKEKVEEKASRKERKKEVVEEEENGAEEEEEETAEDGEEEDEGEEEDEEEEEEDDEGPALKRAAEEEDEADPKRQKTENGASA,11598.14506069,11604.80728,,RESID:51@0|RESID:55@2|RESID:37@3|RESID:55@13,,,1
14474,PTMS_HUMAN,P20962,Parathymosin,P20962,,MSEKSVEAAAELSAKDLKEKKEKVEEKASRKERKKEVVEEEENGAEEEEEETAEDGEEEDEGEEEDEEEEEEDDEGPALKRAAEEEDEADPKRQKTENGASA,0,101,102,MSEKSVEAAAELSAKDLKEKKEKVEEKASRKERKKEVVEEEENGAEEEEEETAEDGEEEDEGEEEDEEEEEEDDEGPALKRAAEEEDEADPKRQKTENGASA,11729.18555069,11735.99988,,RESID:49@0|RESID:55@3|RESID:37@4|RESID:55@14,,,1
14713,PTMS_HUMAN,P20962,Parathymosin,P20962,,MSEKSVEAAAELSAKDLKEKKEKVEEKASRKERKKEVVEEEENGAEEEEEETAEDGEEEDEGEEEDEEEEEEDDEGPALKRAAEEEDEADPKRQKTENGASA,1,101,101,SEKSVEAAAELSAKDLKEKKEKVEEKASRKERKKEVVEEEENGAEEEEEETAEDGEEEDEGEEEDEEEEEEDDEGPALKRAAEEEDEADPKRQKTENGASA,11476.16816469,11482.78728,,RESID:55@2|RESID:55@90,,,1
19568,PTMS_HUMAN,P20962,Parathymosin,P20962,,MSEKSVEAAAELSAKDLKEKKEKVEEKASRKERKKEVVEEEENGAEEEEEETAEDGEEEDEGEEEDEEEEEEDDEGPALKRAAEEEDEADPKRQKTENGASA,1,101,101,SEKSVEAAAELSAKDLKEKKEKVEEKASRKERKKEVVEEEENGAEEEEEETAEDGEEEDEGEEEDEEEEEEDDEGPALKRAAEEEDEADPKRQKTENGASA,11434.15759969,11440.74728,,RESID:55@13,,,0
