PFR,UniProt Id,Entry Accession,Entry Description,Isoform Accession,Isoform Description,Isoform Sequence,Start,End,Length,Proteoform Sequence,Monoisotopic Mass,Average Mass,Sequence Modifications,PTMs,N-Terminal,C-Terminal,Star
1540,PRDX6_HUMAN,P30041,Peroxiredoxin-6,P30041,,MPGGLLLGDVAPNFEANTTVGRIRFHDFLGDSWGILFSHPRDFTPVCTTELGRAAKLAPEFAKRNVKLIALSIDSVEDHLAWSKDINAYNCEEPTEKLPFPIIDDRNRELAILLGMLDPAEKDEKGMPVTARVVFVFGPDKKLKLSILYPATTGRNFDEILRVVISLQLTAEKRVATPVDWKDGDSVMVLPTIPEEEAKKLFPKGVFTKELPSGKKYLRYTPQP,1,223,223,PGGLLLGDVAPNFEANTTVGRIRFHDFLGDSWGILFSHPRDFTPVCTTELGRAAKLAPEFAKRNVKLIALSIDSVEDHLAWSKDINAYNCEEPTEKLPFPIIDDRNRELAILLGMLDPAEKDEKGMPVTARVVFVFGPDKKLKLSILYPATTGRNFDEILRVVISLQLTAEKRVATPVDWKDGDSVMVLPTIPEEEAKKLFPKGVFTKELPSGKKYLRYTPQP,24888.14927469,24903.79348,,,,,1
1802,PRDX6_HUMAN,P30041,Peroxiredoxin-6,P30041,,MPGGLLLGDVAPNFEANTTVGRIRFHDFLGDSWGILFSHPRDFTPVCTTELGRAAKLAPEFAKRNVKLIALSIDSVEDHLAWSKDINAYNCEEPTEKLPFPIIDDRNRELAILLGMLDPAEKDEKGMPVTARVVFVFGPDKKLKLSILYPATTGRNFDEILRVVISLQLTAEKRVATPVDWKDGDSVMVLPTIPEEEAKKLFPKGVFTKELPSGKKYLRYTPQP,1,223,223,PGGLLLGDVAPNFEANTTVGRIRFHDFLGDSWGILFSHPRDFTPVCTTELGRAAKLAPEFAKRNVKLIALSIDSVEDHLAWSKDINAYNCEEPTEKLPFPIIDDRNRELAILLGMLDPAEKDEKGMPVTARVVFVFGPDKKLKLSILYPATTGRNFDEILRVVISLQLTAEKRVATPVDWKDGDSVMVLPTIPEEEAKKLFPKGVFTKELPSGKKYLRYTPQP,25090.09250169,25105.79348,,RESID:38@42|RESID:55@61|RESID:39@87,,,1
1803,PRDX6_HUMAN,P30041,Peroxiredoxin-6,P30041,,MPGGLLLGDVAPNFEANTTVGRIRFHDFLGDSWGILFSHPRDFTPVCTTELGRAAKLAPEFAKRNVKLIALSIDSVEDHLAWSKDINAYNCEEPTEKLPFPIIDDRNRELAILLGMLDPAEKDEKGMPVTARVVFVFGPDKKLKLSILYPATTGRNFDEILRVVISLQLTAEKRVATPVDWKDGDSVMVLPTIPEEEAKKLFPKGVFTKELPSGKKYLRYTPQP,1,223,223,PGGLLLGDVAPNFEANTTVGRIRFHDFLGDSWGILFSHPRDFTPVCTTELGRAAKLAPEFAKRNVKLIALSIDSVEDHLAWSKDINAYNCEEPTEKLPFPIIDDRNRELAILLGMLDPAEKDEKGMPVTARVVFVFGPDKKLKLSILYPATTGRNFDEILRVVISLQLTAEKRVATPVDWKDGDSVMVLPTIPEEEAKKLFPKGVFTKELPSGKKYLRYTPQP,24930.15983969,24945.83348,,RESID:55@61,,,1
2176,PRDX6_HUMAN,P30041,Peroxiredoxin-6,P30041,,MPGGLLLGDVAPNFEANTTVGRIRFHDFLGDSWGILFSHPRDFTPVCTTELGRAAKLAPEFAKRNVKLIALSIDSVEDHLAWSKDINAYNCEEPTEKLPFPIIDDRNRELAILLGMLDPAEKDEKGMPVTARVVFVFGPDKKLKLSILYPATTGRNFDEILRVVISLQLTAEKRVATPVDWKDGDSVMVLPTIPEEEAKKLFPKGVFTKELPSGKKYLRYTPQP,1,223,223,PGGLLLGDVAPNFEANTTVGRIRFHDFLGDSWGILFSHPRDFTPVCTTELGRAAKLAPEFAKRNVKLIALSIDSVEDHLAWSKDINAYNCEEPTEKLPFPIIDDRNRELAILLGMLDPAEKDEKGMPVTARVVFVFGPDKKLKLSILYPATTGRNFDEILRVVISLQLTAEKRVATPVDWKDGDSVMVLPTIPEEEAKKLFPKGVFTKELPSGKKYLRYTPQP,24968.11560569,24983.77348,,RESID:38@42,,,1
2436,PRDX6_HUMAN,P30041,Peroxiredoxin-6,P30041,,MPGGLLLGDVAPNFEANTTVGRIRFHDFLGDSWGILFSHPRDFTPVCTTELGRAAKLAPEFAKRNVKLIALSIDSVEDHLAWSKDINAYNCEEPTEKLPFPIIDDRNRELAILLGMLDPAEKDEKGMPVTARVVFVFGPDKKLKLSILYPATTGRNFDEILRVVISLQLTAEKRVATPVDWKDGDSVMVLPTIPEEEAKKLFPKGVFTKELPSGKKYLRYTPQP,1,223,223,PGGLLLGDVAPNFEANTTVGRIRFHDFLGDSWGILFSHPRDFTPVCTTELGRAAKLAPEFAKRNVKLIALSIDSVEDHLAWSKDINAYNCEEPTEKLPFPIIDDRNRELAILLGMLDPAEKDEKGMPVTARVVFVFGPDKKLKLSILYPATTGRNFDEILRVVISLQLTAEKRVATPVDWKDGDSVMVLPTIPEEEAKKLFPKGVFTKELPSGKKYLRYTPQP,25010.12617069,25025.81348,,RESID:38@42|RESID:55@61,,,1
2669,PRDX6_HUMAN,P30041,Peroxiredoxin-6,P30041,,MPGGLLLGDVAPNFEANTTVGRIRFHDFLGDSWGILFSHPRDFTPVCTTELGRAAKLAPEFAKRNVKLIALSIDSVEDHLAWSKDINAYNCEEPTEKLPFPIIDDRNRELAILLGMLDPAEKDEKGMPVTARVVFVFGPDKKLKLSILYPATTGRNFDEILRVVISLQLTAEKRVATPVDWKDGDSVMVLPTIPEEEAKKLFPKGVFTKELPSGKKYLRYTPQP,1,223,223,PGGLLLGDVAPNFEANTTVGRIRFHDFLGDSWGILFSHPRDFTPVCTTELGRAAKLAPEFAKRNVKLIALSIDSVEDHLAWSKDINAYNCEEPTEKLPFPIIDDRNRELAILLGMLDPAEKDEKGMPVTARVVFVFGPDKKLKLSILYPATTGRNFDEILRVVISLQLTAEKRVATPVDWKDGDSVMVLPTIPEEEAKKLFPKGVFTKELPSGKKYLRYTPQP,25010.12617069,25025.81348,,RESID:55@61|RESID:39@87,,,1
2806,PRDX6_HUMAN,P30041,Peroxiredoxin-6,P30041,,MPGGLLLGDVAPNFEANTTVGRIRFHDFLGDSWGILFSHPRDFTPVCTTELGRAAKLAPEFAKRNVKLIALSIDSVEDHLAWSKDINAYNCEEPTEKLPFPIIDDRNRELAILLGMLDPAEKDEKGMPVTARVVFVFGPDKKLKLSILYPATTGRNFDEILRVVISLQLTAEKRVATPVDWKDGDSVMVLPTIPEEEAKKLFPKGVFTKELPSGKKYLRYTPQP,1,223,223,PGGLLLGDVAPNFEANTTVGRIRFHDFLGDSWGILFSHPRDFTPVCTTELGRAAKLAPEFAKRNVKLIALSIDSVEDHLAWSKDINAYNCEEPTEKLPFPIIDDRNRELAILLGMLDPAEKDEKGMPVTARVVFVFGPDKKLKLSILYPATTGRNFDEILRVVISLQLTAEKRVATPVDWKDGDSVMVLPTIPEEEAKKLFPKGVFTKELPSGKKYLRYTPQP,24930.15983969,24945.83348,,RESID:50@0,,,1
3115,PRDX6_HUMAN,P30041,Peroxiredoxin-6,P30041,,MPGGLLLGDVAPNFEANTTVGRIRFHDFLGDSWGILFSHPRDFTPVCTTELGRAAKLAPEFAKRNVKLIALSIDSVEDHLAWSKDINAYNCEEPTEKLPFPIIDDRNRELAILLGMLDPAEKDEKGMPVTARVVFVFGPDKKLKLSILYPATTGRNFDEILRVVISLQLTAEKRVATPVDWKDGDSVMVLPTIPEEEAKKLFPKGVFTKELPSGKKYLRYTPQP,1,223,223,PGGLLLGDVAPNFEANTTVGRIRFHDFLGDSWGILFSHPRDFTPVCTTELGRAAKLAPEFAKRNVKLIALSIDSVEDHLAWSKDINAYNCEEPTEKLPFPIIDDRNRELAILLGMLDPAEKDEKGMPVTARVVFVFGPDKKLKLSILYPATTGRNFDEILRVVISLQLTAEKRVATPVDWKDGDSVMVLPTIPEEEAKKLFPKGVFTKELPSGKKYLRYTPQP,25132.10306669,25147.83348,,RESID:50@0|RESID:38@42|RESID:55@61|RESID:39@87,,,1
3424,PRDX6_HUMAN,P30041,Peroxiredoxin-6,P30041,,MPGGLLLGDVAPNFEANTTVGRIRFHDFLGDSWGILFSHPRDFTPVCTTELGRAAKLAPEFAKRNVKLIALSIDSVEDHLAWSKDINAYNCEEPTEKLPFPIIDDRNRELAILLGMLDPAEKDEKGMPVTARVVFVFGPDKKLKLSILYPATTGRNFDEILRVVISLQLTAEKRVATPVDWKDGDSVMVLPTIPEEEAKKLFPKGVFTKELPSGKKYLRYTPQP,1,223,223,PGGLLLGDVAPNFEANTTVGRIRFHDFLGDSWGILFSHPRDFTPVCTTELGRAAKLAPEFAKRNVKLIALSIDSVEDHLAWSKDINAYNCEEPTEKLPFPIIDDRNRELAILLGMLDPAEKDEKGMPVTARVVFVFGPDKKLKLSILYPATTGRNFDEILRVVISLQLTAEKRVATPVDWKDGDSVMVLPTIPEEEAKKLFPKGVFTKELPSGKKYLRYTPQP,25010.12617069,25025.81348,,RESID:50@0|RESID:38@42,,,1
