PFR,UniProt Id,Entry Accession,Entry Description,Isoform Accession,Isoform Description,Isoform Sequence,Start,End,Length,Proteoform Sequence,Monoisotopic Mass,Average Mass,Sequence Modifications,PTMs,N-Terminal,C-Terminal,Star
1324,PRDX3_HUMAN,P30048,Thioredoxin-dependent peroxide reductase; mitochondrial,P30048-1,1,MAAAVGRLLRASVARHVSAIPWGISATAALRPAACGRTSLTNLLCSGSSQAKLFSTSSSCHAPAVTQHAPYFKGTAVVNGEFKDLSLDDFKGKYLVLFFYPLDFTFVCPTEIVAFSDKANEFHDVNCEVVAVSVDSHFSHLAWINTPRKNGGLGHMNIALLSDLTKQISRDYGVLLEGSGLALRGLFIIDPNGVIKHLSVNDLPVGRSVEETLRLVKAFQYVETHGEVCPANWTPDSPTIKPSPAASKEYFQKVNQ,62,255,194,PAVTQHAPYFKGTAVVNGEFKDLSLDDFKGKYLVLFFYPLDFTFVCPTEIVAFSDKANEFHDVNCEVVAVSVDSHFSHLAWINTPRKNGGLGHMNIALLSDLTKQISRDYGVLLEGSGLALRGLFIIDPNGVIKHLSVNDLPVGRSVEETLRLVKAFQYVETHGEVCPANWTPDSPTIKPSPAASKEYFQKVNQ,21454.96091469,21468.44948,,,,,1
2370,PRDX3_HUMAN,P30048,Thioredoxin-dependent peroxide reductase; mitochondrial,P30048-1,1,MAAAVGRLLRASVARHVSAIPWGISATAALRPAACGRTSLTNLLCSGSSQAKLFSTSSSCHAPAVTQHAPYFKGTAVVNGEFKDLSLDDFKGKYLVLFFYPLDFTFVCPTEIVAFSDKANEFHDVNCEVVAVSVDSHFSHLAWINTPRKNGGLGHMNIALLSDLTKQISRDYGVLLEGSGLALRGLFIIDPNGVIKHLSVNDLPVGRSVEETLRLVKAFQYVETHGEVCPANWTPDSPTIKPSPAASKEYFQKVNQ,62,255,194,PAVTQHAPYFKGTAVVNGEFKDLSLDDFKGKYLVLFFYPLDFTFVCPTEIVAFSDKANEFHDVNCEVVAVSVDSHFSHLAWINTPRKNGGLGHMNIALLSDLTKQISRDYGVLLEGSGLALRGLFIIDPNGVIKHLSVNDLPVGRSVEETLRLVKAFQYVETHGEVCPANWTPDSPTIKPSPAASKEYFQKVNQ,21496.97147969,21510.48948,,RESID:55@28,,,1
3913,PRDX3_HUMAN,P30048,Thioredoxin-dependent peroxide reductase; mitochondrial,P30048-1,1,MAAAVGRLLRASVARHVSAIPWGISATAALRPAACGRTSLTNLLCSGSSQAKLFSTSSSCHAPAVTQHAPYFKGTAVVNGEFKDLSLDDFKGKYLVLFFYPLDFTFVCPTEIVAFSDKANEFHDVNCEVVAVSVDSHFSHLAWINTPRKNGGLGHMNIALLSDLTKQISRDYGVLLEGSGLALRGLFIIDPNGVIKHLSVNDLPVGRSVEETLRLVKAFQYVETHGEVCPANWTPDSPTIKPSPAASKEYFQKVNQ,62,255,194,PAVTQHAPYFKGTAVVNGEFKDLSLDDFKGKYLVLFFYPLDFTFVCPTEIVAFSDKANEFHDVNCEVVAVSVDSHFSHLAWINTPRKNGGLGHMNIALLSDLTKQISRDYGVLLEGSGLALRGLFIIDPNGVIKHLSVNDLPVGRSVEETLRLVKAFQYVETHGEVCPANWTPDSPTIKPSPAASKEYFQKVNQ,21538.98204469,21552.52948,,RESID:50@0|RESID:55@28,,,1
3914,PRDX3_HUMAN,P30048,Thioredoxin-dependent peroxide reductase; mitochondrial,P30048-1,1,MAAAVGRLLRASVARHVSAIPWGISATAALRPAACGRTSLTNLLCSGSSQAKLFSTSSSCHAPAVTQHAPYFKGTAVVNGEFKDLSLDDFKGKYLVLFFYPLDFTFVCPTEIVAFSDKANEFHDVNCEVVAVSVDSHFSHLAWINTPRKNGGLGHMNIALLSDLTKQISRDYGVLLEGSGLALRGLFIIDPNGVIKHLSVNDLPVGRSVEETLRLVKAFQYVETHGEVCPANWTPDSPTIKPSPAASKEYFQKVNQ,62,255,194,PAVTQHAPYFKGTAVVNGEFKDLSLDDFKGKYLVLFFYPLDFTFVCPTEIVAFSDKANEFHDVNCEVVAVSVDSHFSHLAWINTPRKNGGLGHMNIALLSDLTKQISRDYGVLLEGSGLALRGLFIIDPNGVIKHLSVNDLPVGRSVEETLRLVKAFQYVETHGEVCPANWTPDSPTIKPSPAASKEYFQKVNQ,21496.97147969,21510.48948,,RESID:50@0,,,1
8430,PRDX3_HUMAN,P30048,Thioredoxin-dependent peroxide reductase; mitochondrial,P30048-1,1,MAAAVGRLLRASVARHVSAIPWGISATAALRPAACGRTSLTNLLCSGSSQAKLFSTSSSCHAPAVTQHAPYFKGTAVVNGEFKDLSLDDFKGKYLVLFFYPLDFTFVCPTEIVAFSDKANEFHDVNCEVVAVSVDSHFSHLAWINTPRKNGGLGHMNIALLSDLTKQISRDYGVLLEGSGLALRGLFIIDPNGVIKHLSVNDLPVGRSVEETLRLVKAFQYVETHGEVCPANWTPDSPTIKPSPAASKEYFQKVNQ,1,255,255,AAAVGRLLRASVARHVSAIPWGISATAALRPAACGRTSLTNLLCSGSSQAKLFSTSSSCHAPAVTQHAPYFKGTAVVNGEFKDLSLDDFKGKYLVLFFYPLDFTFVCPTEIVAFSDKANEFHDVNCEVVAVSVDSHFSHLAWINTPRKNGGLGHMNIALLSDLTKQISRDYGVLLEGSGLALRGLFIIDPNGVIKHLSVNDLPVGRSVEETLRLVKAFQYVETHGEVCPANWTPDSPTIKPSPAASKEYFQKVNQ,27586.14521969,27603.50238,,RESID:41@0,,,1
12507,PRDX3_HUMAN,P30048,Thioredoxin-dependent peroxide reductase; mitochondrial,P30048-1,1,MAAAVGRLLRASVARHVSAIPWGISATAALRPAACGRTSLTNLLCSGSSQAKLFSTSSSCHAPAVTQHAPYFKGTAVVNGEFKDLSLDDFKGKYLVLFFYPLDFTFVCPTEIVAFSDKANEFHDVNCEVVAVSVDSHFSHLAWINTPRKNGGLGHMNIALLSDLTKQISRDYGVLLEGSGLALRGLFIIDPNGVIKHLSVNDLPVGRSVEETLRLVKAFQYVETHGEVCPANWTPDSPTIKPSPAASKEYFQKVNQ,62,255,194,PAVTQHAPYFKGTAVVNGEFKDLSLDDFKGKYLVLFFYPLDFTFVCPTEIVAFSDKANEFHDVNCEVVAVSVDSHFSHLAWINTPRKNGGLGHMNIALLSDLTKQISRDYGVLLEGSGLALRGLFIIDPNGVIKHLSVNDLPVGRSVEETLRLVKTFQYVETHGEVCPANWTPDSPTIKPSPAASKEYFQKVNQ,21564.93781569,21578.45578,PSI-MOD:26@217,RESID:38@83,,,1
12510,PRDX3_HUMAN,P30048,Thioredoxin-dependent peroxide reductase; mitochondrial,P30048-1,1,MAAAVGRLLRASVARHVSAIPWGISATAALRPAACGRTSLTNLLCSGSSQAKLFSTSSSCHAPAVTQHAPYFKGTAVVNGEFKDLSLDDFKGKYLVLFFYPLDFTFVCPTEIVAFSDKANEFHDVNCEVVAVSVDSHFSHLAWINTPRKNGGLGHMNIALLSDLTKQISRDYGVLLEGSGLALRGLFIIDPNGVIKHLSVNDLPVGRSVEETLRLVKAFQYVETHGEVCPANWTPDSPTIKPSPAASKEYFQKVNQ,0,255,256,MAAAVGRLLRASVARHVSAIPWGISATAALRPAACGRTSLTNLLCSGSSQAKLFSTSSSCHAPAVTQHAPYFKGTAVVNGEFKDLSLDDFKGKYLVLFFYPLDFTFVCPTEIVAFSDKANEFHDVNCEVVAVSVDSHFSHLAWINTPRKNGGLGHMNIALLSDLTKQISRDYGVLLEGSGLALRGLFIIDPNGVIKHLSVNDLPVGRSVEETLRLVKAFQYVETHGEVCPANWTPDSPTIKPSPAASKEYFQKVNQ,27717.18570969,27734.69498,,RESID:49@0,,,1
12602,PRDX3_HUMAN,P30048,Thioredoxin-dependent peroxide reductase; mitochondrial,P30048-1,1,MAAAVGRLLRASVARHVSAIPWGISATAALRPAACGRTSLTNLLCSGSSQAKLFSTSSSCHAPAVTQHAPYFKGTAVVNGEFKDLSLDDFKGKYLVLFFYPLDFTFVCPTEIVAFSDKANEFHDVNCEVVAVSVDSHFSHLAWINTPRKNGGLGHMNIALLSDLTKQISRDYGVLLEGSGLALRGLFIIDPNGVIKHLSVNDLPVGRSVEETLRLVKAFQYVETHGEVCPANWTPDSPTIKPSPAASKEYFQKVNQ,62,255,194,PAVTQHAPYFKGTAVVNGEFKDLSLDDFKGKYLVLFFYPLDFTFVCPTEIVAFSDKANEFHDVNCEVVAVSVDSHFSHLAWINTPRKNGGLGHMNIALLSDLTKQISRDYGVLLEGSGLALRGLFIIDPNGVIKHLSVNDLPVGRSVEETLRLVKAFQYVETHGEVCPANWTPDSPTIKPSPAASKEYFQKVNQ,21534.92724569,21548.42948,,RESID:38@83,,,1
12603,PRDX3_HUMAN,P30048,Thioredoxin-dependent peroxide reductase; mitochondrial,P30048-1,1,MAAAVGRLLRASVARHVSAIPWGISATAALRPAACGRTSLTNLLCSGSSQAKLFSTSSSCHAPAVTQHAPYFKGTAVVNGEFKDLSLDDFKGKYLVLFFYPLDFTFVCPTEIVAFSDKANEFHDVNCEVVAVSVDSHFSHLAWINTPRKNGGLGHMNIALLSDLTKQISRDYGVLLEGSGLALRGLFIIDPNGVIKHLSVNDLPVGRSVEETLRLVKAFQYVETHGEVCPANWTPDSPTIKPSPAASKEYFQKVNQ,62,255,194,PAVTQHAPYFKGTAVVNGEFKDLSLDDFKGKYLVLFFYPLDFTFVCPTEIVAFSDKANEFHDVNCEVVAVSVDSHFSHLAWINTPRKNGGLGHMNIALLSDLTKQISRDYGVLLEGSGLALRGLFIIDPNGVIKHLSVNDLPVGRSVEETLRLVKTFQYVETHGEVCPANWTPDSPTIKPSPAASKEYFQKVNQ,21526.98204969,21540.51578,PSI-MOD:26@217,RESID:55@28,,,1
12604,PRDX3_HUMAN,P30048,Thioredoxin-dependent peroxide reductase; mitochondrial,P30048-1,1,MAAAVGRLLRASVARHVSAIPWGISATAALRPAACGRTSLTNLLCSGSSQAKLFSTSSSCHAPAVTQHAPYFKGTAVVNGEFKDLSLDDFKGKYLVLFFYPLDFTFVCPTEIVAFSDKANEFHDVNCEVVAVSVDSHFSHLAWINTPRKNGGLGHMNIALLSDLTKQISRDYGVLLEGSGLALRGLFIIDPNGVIKHLSVNDLPVGRSVEETLRLVKAFQYVETHGEVCPANWTPDSPTIKPSPAASKEYFQKVNQ,62,255,194,PAVTQHAPYFKGTAVVNGEFKDLSLDDFKGKYLVLFFYPLDFTFVCPTEIVAFSDKANEFHDVNCEVVAVSVDSHFSHLAWINTPRKNGGLGHMNIALLSDLTKQISRDYGVLLEGSGLALRGLFIIDPNGVIKHLSVNDLPVGRSVEETLRLVKTFQYVETHGEVCPANWTPDSPTIKPSPAASKEYFQKVNQ,21484.97148469,21498.47578,PSI-MOD:26@217,,,,1
12901,PRDX3_HUMAN,P30048,Thioredoxin-dependent peroxide reductase; mitochondrial,P30048-1,1,MAAAVGRLLRASVARHVSAIPWGISATAALRPAACGRTSLTNLLCSGSSQAKLFSTSSSCHAPAVTQHAPYFKGTAVVNGEFKDLSLDDFKGKYLVLFFYPLDFTFVCPTEIVAFSDKANEFHDVNCEVVAVSVDSHFSHLAWINTPRKNGGLGHMNIALLSDLTKQISRDYGVLLEGSGLALRGLFIIDPNGVIKHLSVNDLPVGRSVEETLRLVKAFQYVETHGEVCPANWTPDSPTIKPSPAASKEYFQKVNQ,62,255,194,PAVTQHAPYFKGTAVVNGEFKDLSLDDFKGKYLVLFFYPLDFTFVCPTEIVAFSDKANEFHDVNCEVVAVSVDSHFSHLAWINTPRKNGGLGHMNIALLSDLTKQISQDYGVLLEGSGLALRGLFIIDPNGVIKHLSVNDLPVGRSVEETLRLVKAFQYVETHGEVCPANWTPDSPTIKPSPAASKEYFQKVNQ,21426.91838469,21440.39268,PSI-MOD:16@169,,,,1
13254,PRDX3_HUMAN,P30048,Thioredoxin-dependent peroxide reductase; mitochondrial,P30048-1,1,MAAAVGRLLRASVARHVSAIPWGISATAALRPAACGRTSLTNLLCSGSSQAKLFSTSSSCHAPAVTQHAPYFKGTAVVNGEFKDLSLDDFKGKYLVLFFYPLDFTFVCPTEIVAFSDKANEFHDVNCEVVAVSVDSHFSHLAWINTPRKNGGLGHMNIALLSDLTKQISRDYGVLLEGSGLALRGLFIIDPNGVIKHLSVNDLPVGRSVEETLRLVKAFQYVETHGEVCPANWTPDSPTIKPSPAASKEYFQKVNQ,62,255,194,PAVTQHAPYFKGTAVVNGEFKDLSLDDFKGKYLVLFFYPLDFTFVCPTEIVAFSDKANEFHDVNCEVVAVSVDSHFSHLAWINTPRKNGGLGHMNIALLSDLTKQISQDYGVLLEGSGLALRGLFIIDPNGVIKHLSVNDLPVGRSVEETLRLVKAFQYVETHGEVCPANWTPDSPTIKPSPAASKEYFQKVNQ,21506.88471569,21520.37268,PSI-MOD:16@169,RESID:38@83,,,1
14625,PRDX3_HUMAN,P30048,Thioredoxin-dependent peroxide reductase; mitochondrial,P30048-1,1,MAAAVGRLLRASVARHVSAIPWGISATAALRPAACGRTSLTNLLCSGSSQAKLFSTSSSCHAPAVTQHAPYFKGTAVVNGEFKDLSLDDFKGKYLVLFFYPLDFTFVCPTEIVAFSDKANEFHDVNCEVVAVSVDSHFSHLAWINTPRKNGGLGHMNIALLSDLTKQISRDYGVLLEGSGLALRGLFIIDPNGVIKHLSVNDLPVGRSVEETLRLVKAFQYVETHGEVCPANWTPDSPTIKPSPAASKEYFQKVNQ,62,255,194,PAVTQHAPYFKGTAVVNGEFKDLSLDDFKGKYLVLFFYPLDFTFVCPTEIVAFSDKANEFHDVNCEVVAVSVDSHFSHLAWINTPRKNGGLGHMNIALLSDLTKQISRDYGVLLEGSGLALRGLFIIDPNGVIKHLSVNDLPVGRSVEETLRLVKTFQYVETHGEVCPANWTPDSPTIKPSPAASKEYFQKVNQ,21526.98204969,21540.51578,PSI-MOD:26@217,RESID:50@0,,,1
