PFR,UniProt Id,Entry Accession,Entry Description,Isoform Accession,Isoform Description,Isoform Sequence,Start,End,Length,Proteoform Sequence,Monoisotopic Mass,Average Mass,Sequence Modifications,PTMs,N-Terminal,C-Terminal,Star
18595,FCERG_HUMAN,P30273,High affinity immunoglobulin epsilon receptor subunit gamma,P30273,,MIPAVVLLLLLLVEQAAALGEPQLCYILDAILFLYGIVLTLLYCRLKIQVRKAAITSYEKSDGVYTGLSTRNQETYETLKHEKPPQ,18,85,68,LGEPQLCYILDAILFLYGIVLTLLYCRLKIQVRKAAITSYEKSDGVYTGLSTRNQETYETLKHEKPPQ,7803.146265,7808.08838,,,,,0
18596,FCERG_HUMAN,P30273,High affinity immunoglobulin epsilon receptor subunit gamma,P30273,,MIPAVVLLLLLLVEQAAALGEPQLCYILDAILFLYGIVLTLLYCRLKIQVRKAAITSYEKSDGVYTGLSTRNQETYETLKHEKPPQ,18,85,68,LGEPQLCYILDAILFLYGIVLTLLYCRLKIQVRKAAITSYEKSDGVYTGLSTRNQETYETLKHEKPPQ,7883.112596,7888.06838,,RESID:38@59,,,0
18597,FCERG_HUMAN,P30273,High affinity immunoglobulin epsilon receptor subunit gamma,P30273,,MIPAVVLLLLLLVEQAAALGEPQLCYILDAILFLYGIVLTLLYCRLKIQVRKAAITSYEKSDGVYTGLSTRNQETYETLKHEKPPQ,18,85,68,LGEPQLCYILDAILFLYGIVLTLLYCRLKIQVRKAAITSYEKSDGVYTGLSTRNQETYETLKHEKPPQ,8043.045258,8048.02838,,RESID:39@46|RESID:39@57|RESID:38@59,,,0
18598,FCERG_HUMAN,P30273,High affinity immunoglobulin epsilon receptor subunit gamma,P30273,,MIPAVVLLLLLLVEQAAALGEPQLCYILDAILFLYGIVLTLLYCRLKIQVRKAAITSYEKSDGVYTGLSTRNQETYETLKHEKPPQ,18,85,68,LGEPQLCYILDAILFLYGIVLTLLYCRLKIQVRKAAITSYEKSDGVYTGLSTRNQETYETLKHEKPPQ,7883.112596,7888.06838,,RESID:39@46,,,0
18599,FCERG_HUMAN,P30273,High affinity immunoglobulin epsilon receptor subunit gamma,P30273,,MIPAVVLLLLLLVEQAAALGEPQLCYILDAILFLYGIVLTLLYCRLKIQVRKAAITSYEKSDGVYTGLSTRNQETYETLKHEKPPQ,18,85,68,LGEPQLCYILDAILFLYGIVLTLLYCRLKIQVRKAAITSYEKSDGVYTGLSTRNQETYETLKHEKPPQ,7883.112596,7888.06838,,RESID:39@57,,,0
18600,FCERG_HUMAN,P30273,High affinity immunoglobulin epsilon receptor subunit gamma,P30273,,MIPAVVLLLLLLVEQAAALGEPQLCYILDAILFLYGIVLTLLYCRLKIQVRKAAITSYEKSDGVYTGLSTRNQETYETLKHEKPPQ,18,85,68,LGEPQLCYILDAILFLYGIVLTLLYCRLKIQVRKAAITSYEKSDGVYTGLSTRNQETYETLKHEKPPQ,7963.078927,7968.04838,,RESID:39@46|RESID:39@57,,,0
18601,FCERG_HUMAN,P30273,High affinity immunoglobulin epsilon receptor subunit gamma,P30273,,MIPAVVLLLLLLVEQAAALGEPQLCYILDAILFLYGIVLTLLYCRLKIQVRKAAITSYEKSDGVYTGLSTRNQETYETLKHEKPPQ,18,85,68,LGEPQLCYILDAILFLYGIVLTLLYCRLKIQVRKAAITSYEKSDGVYTGLSTRNQETYETLKHEKPPQ,7963.078927,7968.04838,,RESID:39@46|RESID:38@59,,,0
18602,FCERG_HUMAN,P30273,High affinity immunoglobulin epsilon receptor subunit gamma,P30273,,MIPAVVLLLLLLVEQAAALGEPQLCYILDAILFLYGIVLTLLYCRLKIQVRKAAITSYEKSDGVYTGLSTRNQETYETLKHEKPPQ,18,85,68,LGEPQLCYILDAILFLYGIVLTLLYCRLKIQVRKAAITSYEKSDGVYTGLSTRNQETYETLKHEKPPQ,7963.078927,7968.04838,,RESID:39@57|RESID:38@59,,,0
18603,FCERG_HUMAN,P30273,High affinity immunoglobulin epsilon receptor subunit gamma,P30273,,MIPAVVLLLLLLVEQAAALGEPQLCYILDAILFLYGIVLTLLYCRLKIQVRKAAITSYEKSDGVYTGLSTRNQETYETLKHEKPPQ,18,84,67,LGEPQLCYILDAILFLYGIVLTLLYCRLKIQVRKAAITSYEKSDGVYTGLSTRNQETYETLKHEKPP,7675.087685,7679.95768,,,,,0
18604,FCERG_HUMAN,P30273,High affinity immunoglobulin epsilon receptor subunit gamma,P30273,,MIPAVVLLLLLLVEQAAALGEPQLCYILDAILFLYGIVLTLLYCRLKIQVRKAAITSYEKSDGVYTGLSTRNQETYETLKHEKPPQ,28,85,58,DAILFLYGIVLTLLYCRLKIQVRKAAITSYEKSDGVYTGLSTRNQETYETLKHEKPPQ,6673.562115,6677.72118,,,,,0
18605,FCERG_HUMAN,P30273,High affinity immunoglobulin epsilon receptor subunit gamma,P30273,,MIPAVVLLLLLLVEQAAALGEPQLCYILDAILFLYGIVLTLLYCRLKIQVRKAAITSYEKSDGVYTGLSTRNQETYETLKHEKPPQ,18,85,68,LGEPQLCYILDAILFLYGIVLTLLYCRLKIQVRKAAITSYEKSDGVYTGLSTRNQETYETLKHEKPPQ,7925.123161,7930.10838,,RESID:39@46,PSI-MOD:1458,,0
18609,FCERG_HUMAN,P30273,High affinity immunoglobulin epsilon receptor subunit gamma,P30273,,MIPAVVLLLLLLVEQAAALGEPQLCYILDAILFLYGIVLTLLYCRLKIQVRKAAITSYEKSDGVYTGLSTRNQETYETLKHEKPPQ,18,85,68,LGEPQLCYILDAILFLYGIVLTLLYCRLKIQVRKAAITSYEKSDGVYTGLSTRNQETYETLKHEKPPQ,7845.15683,7850.12838,,,PSI-MOD:1458,,0
18610,FCERG_HUMAN,P30273,High affinity immunoglobulin epsilon receptor subunit gamma,P30273,,MIPAVVLLLLLLVEQAAALGEPQLCYILDAILFLYGIVLTLLYCRLKIQVRKAAITSYEKSDGVYTGLSTRNQETYETLKHEKPPQ,18,65,48,LGEPQLCYILDAILFLYGIVLTLLYCRLKIQVRKAAITSYEKSDGVYT,5465.974965,5469.52628,,,,,0
18611,FCERG_HUMAN,P30273,High affinity immunoglobulin epsilon receptor subunit gamma,P30273,,MIPAVVLLLLLLVEQAAALGEPQLCYILDAILFLYGIVLTLLYCRLKIQVRKAAITSYEKSDGVYTGLSTRNQETYETLKHEKPPQ,17,85,69,ALGEPQLCYILDAILFLYGIVLTLLYCRLKIQVRKAAITSYEKSDGVYTGLSTRNQETYETLKHEKPPQ,7874.183375,7879.16718,,,,,0
18612,FCERG_HUMAN,P30273,High affinity immunoglobulin epsilon receptor subunit gamma,P30273,,MIPAVVLLLLLLVEQAAALGEPQLCYILDAILFLYGIVLTLLYCRLKIQVRKAAITSYEKSDGVYTGLSTRNQETYETLKHEKPPQ,32,85,54,FLYGIVLTLLYCRLKIQVRKAAITSYEKSDGVYTGLSTRNQETYETLKHEKPPQ,6261.329945,6265.23498,,,,,0
18613,FCERG_HUMAN,P30273,High affinity immunoglobulin epsilon receptor subunit gamma,P30273,,MIPAVVLLLLLLVEQAAALGEPQLCYILDAILFLYGIVLTLLYCRLKIQVRKAAITSYEKSDGVYTGLSTRNQETYETLKHEKPPQ,18,79,62,LGEPQLCYILDAILFLYGIVLTLLYCRLKIQVRKAAITSYEKSDGVYTGLSTRNQETYETLK,7086.785705,7091.29358,,,,,0
18614,FCERG_HUMAN,P30273,High affinity immunoglobulin epsilon receptor subunit gamma,P30273,,MIPAVVLLLLLLVEQAAALGEPQLCYILDAILFLYGIVLTLLYCRLKIQVRKAAITSYEKSDGVYTGLSTRNQETYETLKHEKPPQ,31,85,55,LFLYGIVLTLLYCRLKIQVRKAAITSYEKSDGVYTGLSTRNQETYETLKHEKPPQ,6374.414005,6378.39438,,,,,0
18615,FCERG_HUMAN,P30273,High affinity immunoglobulin epsilon receptor subunit gamma,P30273,,MIPAVVLLLLLLVEQAAALGEPQLCYILDAILFLYGIVLTLLYCRLKIQVRKAAITSYEKSDGVYTGLSTRNQETYETLKHEKPPQ,18,75,58,LGEPQLCYILDAILFLYGIVLTLLYCRLKIQVRKAAITSYEKSDGVYTGLSTRNQETY,6615.516415,6619.73948,,,,,0
