PFR,UniProt Id,Entry Accession,Entry Description,Isoform Accession,Isoform Description,Isoform Sequence,Start,End,Length,Proteoform Sequence,Monoisotopic Mass,Average Mass,Sequence Modifications,PTMs,N-Terminal,C-Terminal,Star
8650,PRDX1_MOUSE,P35700,Peroxiredoxin-1,P35700,,MSSGNAKIGYPAPNFKATAVMPDGQFKDISLSEYKGKYVVFFFYPLDFTFVCPTEIIAFSDRADEFKKLNCQVIGASVDSHFCHLAWINTPKKQGGLGPMNIPLISDPKRTIAQDYGVLKADEGISFRGLFIIDDKGILRQITINDLPVGRSVDEIIRLVQAFQFTDKHGEVCPAGWKPGSDTIKPDVNKSKEYFSKQK,1,198,198,SSGNAKIGYPAPNFKATAVMPDGQFKDISLSEYKGKYVVFFFYPLDFTFVCPTEIIAFSDRADEFKKLNCQVIGASVDSHFCHLAWINTPKKQGGLGPMNIPLISDPKRTIAQDYGVLKADEGISFRGLFIIDDKGILRQITINDLPVGRSVDEIIRLVQAFQFTDKHGEVCPAGWKPGSDTIKPDVNKSKEYFSKQK,22153.28695069,22167.32588,,RESID:51@0|RESID:38@88,,,1
8651,PRDX1_MOUSE,P35700,Peroxiredoxin-1,P35700,,MSSGNAKIGYPAPNFKATAVMPDGQFKDISLSEYKGKYVVFFFYPLDFTFVCPTEIIAFSDRADEFKKLNCQVIGASVDSHFCHLAWINTPKKQGGLGPMNIPLISDPKRTIAQDYGVLKADEGISFRGLFIIDDKGILRQITINDLPVGRSVDEIIRLVQAFQFTDKHGEVCPAGWKPGSDTIKPDVNKSKEYFSKQK,1,198,198,SSGNAKIGYPAPNFKATAVMPDGQFKDISLSEYKGKYVVFFFYPLDFTFVCPTEIIAFSDRADEFKKLNCQVIGASVDSHFCHLAWINTPKKQGGLGPMNIPLISDPKRTIAQDYGVLKADEGISFRGLFIIDDKGILRQITINDLPVGRSVDEIIRLVQAFQFTDKHGEVCPAGWKPGSDTIKPDVNKSKEYFSKQK,22073.32061969,22087.34588,,RESID:51@0,,,1
8726,PRDX1_MOUSE,P35700,Peroxiredoxin-1,P35700,,MSSGNAKIGYPAPNFKATAVMPDGQFKDISLSEYKGKYVVFFFYPLDFTFVCPTEIIAFSDRADEFKKLNCQVIGASVDSHFCHLAWINTPKKQGGLGPMNIPLISDPKRTIAQDYGVLKADEGISFRGLFIIDDKGILRQITINDLPVGRSVDEIIRLVQAFQFTDKHGEVCPAGWKPGSDTIKPDVNKSKEYFSKQK,1,198,198,SSGNAKIGYPAPNFKATAVMPDGQFKDISLSEYKGKYVVFFFYPLDFTFVCPTEIIAFSDRADEFKKLNCQVIGASVDSHFCHLAWINTPKKQGGLGPMNIPLISDPKRTIAQDYGVLKADEGISFRGLFIIDDKGILRQITINDLPVGRSVDEIIRLVQAFQFTDKHGEVCPAGWKPGSDTIKPDVNKSKEYFSKQK,22115.33118469,22129.38588,,RESID:51@0|RESID:55@195,,,1
8768,PRDX1_MOUSE,P35700,Peroxiredoxin-1,P35700,,MSSGNAKIGYPAPNFKATAVMPDGQFKDISLSEYKGKYVVFFFYPLDFTFVCPTEIIAFSDRADEFKKLNCQVIGASVDSHFCHLAWINTPKKQGGLGPMNIPLISDPKRTIAQDYGVLKADEGISFRGLFIIDDKGILRQITINDLPVGRSVDEIIRLVQAFQFTDKHGEVCPAGWKPGSDTIKPDVNKSKEYFSKQK,1,198,198,SSGNAKIGYPAPNFKATAVMPDGQFKDISLSEYKGKYVVFFFYPLDFTFVCPTEIIAFSDRADEFKKLNCQVIGASVDSHFCHLAWINTPKKQGGLGPMNIPLISDPKRTIAQDYGVLKADEGISFRGLFIIDDKGILRQITINDLPVGRSVDEIIRLVQAFQFTDKHGEVCPAGWKPGSDTIKPDVNKSKEYFSKQK,22115.33118469,22129.38588,,RESID:51@0|RESID:55@33,,,1
9025,PRDX1_MOUSE,P35700,Peroxiredoxin-1,P35700,,MSSGNAKIGYPAPNFKATAVMPDGQFKDISLSEYKGKYVVFFFYPLDFTFVCPTEIIAFSDRADEFKKLNCQVIGASVDSHFCHLAWINTPKKQGGLGPMNIPLISDPKRTIAQDYGVLKADEGISFRGLFIIDDKGILRQITINDLPVGRSVDEIIRLVQAFQFTDKHGEVCPAGWKPGSDTIKPDVNKSKEYFSKQK,1,198,198,SSGNAKIGYPAPNFKATAVMPDGQFKDISLSEYKGKYVVFFFYPLDFTFVCPTEIIAFSDRADEFKKLNCQVIGASVDSHFCHLAWINTPKKQGGLGPMNIPLISDPKRTIAQDYGVLKADEGISFRGLFIIDDKGILRQITINDLPVGRSVDEIIRLVQAFQFTDKHGEVCPAGWKPGSDTIKPDVNKSKEYFSKQK,22355.23017769,22369.32588,,RESID:51@0|RESID:38@88|RESID:38@181|RESID:39@192|RESID:55@195,,,1
9096,PRDX1_MOUSE,P35700,Peroxiredoxin-1,P35700,,MSSGNAKIGYPAPNFKATAVMPDGQFKDISLSEYKGKYVVFFFYPLDFTFVCPTEIIAFSDRADEFKKLNCQVIGASVDSHFCHLAWINTPKKQGGLGPMNIPLISDPKRTIAQDYGVLKADEGISFRGLFIIDDKGILRQITINDLPVGRSVDEIIRLVQAFQFTDKHGEVCPAGWKPGSDTIKPDVNKSKEYFSKQK,1,198,198,SSGNAKIGYPAPNFKATAVMPDGQFKDISLSEYKGKYVVFFFYPLDFTFVCPTEIIAFSDRADEFKKLNCQVIGASVDSHFCHLAWINTPKKQGGLGPMNIPLISDPKRTIAQDYGVLKADEGISFRGLFIIDDKGILRQITINDLPVGRSVDEIIRLVQAFQFTDKHGEVCPAGWKPGSDTIKPDVNKSKEYFSKQK,22031.31005469,22045.30588,,,,,1
9097,PRDX1_MOUSE,P35700,Peroxiredoxin-1,P35700,,MSSGNAKIGYPAPNFKATAVMPDGQFKDISLSEYKGKYVVFFFYPLDFTFVCPTEIIAFSDRADEFKKLNCQVIGASVDSHFCHLAWINTPKKQGGLGPMNIPLISDPKRTIAQDYGVLKADEGISFRGLFIIDDKGILRQITINDLPVGRSVDEIIRLVQAFQFTDKHGEVCPAGWKPGSDTIKPDVNKSKEYFSKQK,1,198,198,SSGNAKIGYPAPNFKATAVMPDGQFKDISLSEYKGKYVVFFFYPLDFTFVCPTEIIAFSDRADEFKKLNCQVIGASVDSHFCHLAWINTPKKQGGLGPMNIPLISDPKRTIAQDYGVLKADEGISFRGLFIIDDKGILRQITINDLPVGRSVDEIIRLVQAFQFTDKHGEVCPAGWKPGSDTIKPDVNKSKEYFSKQK,22233.25328169,22247.30588,,RESID:51@0|RESID:38@88|RESID:38@181,,,1
9133,PRDX1_MOUSE,P35700,Peroxiredoxin-1,P35700,,MSSGNAKIGYPAPNFKATAVMPDGQFKDISLSEYKGKYVVFFFYPLDFTFVCPTEIIAFSDRADEFKKLNCQVIGASVDSHFCHLAWINTPKKQGGLGPMNIPLISDPKRTIAQDYGVLKADEGISFRGLFIIDDKGILRQITINDLPVGRSVDEIIRLVQAFQFTDKHGEVCPAGWKPGSDTIKPDVNKSKEYFSKQK,1,198,198,SSGNAKIGYPAPNFKATAVMPDGQFKDISLSEYKGKYVVFFFYPLDFTFVCPTEIIAFSDRADEFKKLNCQVIGASVDSHFCHLAWINTPKKQGGLGPMNIPLISDPKRTIAQDYGVLKADEGISFRGLFIIDDKGILRQITINDLPVGRSVDEIIRLVQAFQFTDKHGEVCPAGWKPGSDTIKPDVNKSKEYFSKQK,22313.21961269,22327.28588,,RESID:51@0|RESID:38@88|RESID:38@181|RESID:39@192,,,1
9188,PRDX1_MOUSE,P35700,Peroxiredoxin-1,P35700,,MSSGNAKIGYPAPNFKATAVMPDGQFKDISLSEYKGKYVVFFFYPLDFTFVCPTEIIAFSDRADEFKKLNCQVIGASVDSHFCHLAWINTPKKQGGLGPMNIPLISDPKRTIAQDYGVLKADEGISFRGLFIIDDKGILRQITINDLPVGRSVDEIIRLVQAFQFTDKHGEVCPAGWKPGSDTIKPDVNKSKEYFSKQK,0,198,199,MSSGNAKIGYPAPNFKATAVMPDGQFKDISLSEYKGKYVVFFFYPLDFTFVCPTEIIAFSDRADEFKKLNCQVIGASVDSHFCHLAWINTPKKQGGLGPMNIPLISDPKRTIAQDYGVLKADEGISFRGLFIIDDKGILRQITINDLPVGRSVDEIIRLVQAFQFTDKHGEVCPAGWKPGSDTIKPDVNKSKEYFSKQK,22162.35054469,22176.49848,,,,,1
9202,PRDX1_MOUSE,P35700,Peroxiredoxin-1,P35700,,MSSGNAKIGYPAPNFKATAVMPDGQFKDISLSEYKGKYVVFFFYPLDFTFVCPTEIIAFSDRADEFKKLNCQVIGASVDSHFCHLAWINTPKKQGGLGPMNIPLISDPKRTIAQDYGVLKADEGISFRGLFIIDDKGILRQITINDLPVGRSVDEIIRLVQAFQFTDKHGEVCPAGWKPGSDTIKPDVNKSKEYFSKQK,1,198,198,SSGNAKIGYPAPNFKATAVMPDGQFKDISLSEYKGKYVVFFFYPLDFTFVCPTEIIAFSDRADEFKKLNCQVIGASVDSHFCHLAWINTPKKQGGLGPMNIPLISDPKRTIAQDYGVLKADEGISFRGLFIIDDKGILRQITINDLPVGRSVDEIIRLVQAFQFTDKHGEVCPAGWKPGSDTIKPDVNKSKEYFSKQK,22317.27441169,22331.38588,,RESID:51@0|RESID:55@25|RESID:55@33|RESID:38@88|RESID:38@181,,,1
9233,PRDX1_MOUSE,P35700,Peroxiredoxin-1,P35700,,MSSGNAKIGYPAPNFKATAVMPDGQFKDISLSEYKGKYVVFFFYPLDFTFVCPTEIIAFSDRADEFKKLNCQVIGASVDSHFCHLAWINTPKKQGGLGPMNIPLISDPKRTIAQDYGVLKADEGISFRGLFIIDDKGILRQITINDLPVGRSVDEIIRLVQAFQFTDKHGEVCPAGWKPGSDTIKPDVNKSKEYFSKQK,1,198,198,SSGNAKIGYPAPNFKATAVMPDGQFKDISLSEYKGKYVVFFFYPLDFTFVCPTEIIAFSDRADEFKKLNCQVIGASVDSHFCHLAWINTPKKQGGLGPMNIPLISDPKRTIAQDYGVLKADEGISFRGLFIIDDKGILRQITINDLPVGRSVDEIIRLVQAFQFTDKHGEVCPAGWKPGSDTIKPDVNKSKEYFSKQK,22115.33118469,22129.38588,,RESID:51@0|RESID:55@25,,,1
9258,PRDX1_MOUSE,P35700,Peroxiredoxin-1,P35700,,MSSGNAKIGYPAPNFKATAVMPDGQFKDISLSEYKGKYVVFFFYPLDFTFVCPTEIIAFSDRADEFKKLNCQVIGASVDSHFCHLAWINTPKKQGGLGPMNIPLISDPKRTIAQDYGVLKADEGISFRGLFIIDDKGILRQITINDLPVGRSVDEIIRLVQAFQFTDKHGEVCPAGWKPGSDTIKPDVNKSKEYFSKQK,1,198,198,SSGNAKIGYPAPNFKATAVMPDGQFKDISLSEYKGKYVVFFFYPLDFTFVCPTEIIAFSDRADEFKKLNCQVIGASVDSHFCHLAWINTPKKQGGLGPMNIPLISDPKRTIAQDYGVLKADEGISFRGLFIIDDKGILRQITINDLPVGRSVDEIIRLVQAFQFTDKHGEVCPAGWKPGSDTIKPDVNKSKEYFSKQK,22199.35231469,22213.46588,,RESID:51@0|RESID:55@14|RESID:55@25|RESID:55@33,,,1
9303,PRDX1_MOUSE,P35700,Peroxiredoxin-1,P35700,,MSSGNAKIGYPAPNFKATAVMPDGQFKDISLSEYKGKYVVFFFYPLDFTFVCPTEIIAFSDRADEFKKLNCQVIGASVDSHFCHLAWINTPKKQGGLGPMNIPLISDPKRTIAQDYGVLKADEGISFRGLFIIDDKGILRQITINDLPVGRSVDEIIRLVQAFQFTDKHGEVCPAGWKPGSDTIKPDVNKSKEYFSKQK,0,198,199,MSSGNAKIGYPAPNFKATAVMPDGQFKDISLSEYKGKYVVFFFYPLDFTFVCPTEIIAFSDRADEFKKLNCQVIGASVDSHFCHLAWINTPKKQGGLGPMNIPLISDPKRTIAQDYGVLKADEGISFRGLFIIDDKGILRQITINDLPVGRSVDEIIRLVQAFQFTDKHGEVCPAGWKPGSDTIKPDVNKSKEYFSKQK,22204.36110969,22218.53848,,RESID:49@0,,,1
9381,PRDX1_MOUSE,P35700,Peroxiredoxin-1,P35700,,MSSGNAKIGYPAPNFKATAVMPDGQFKDISLSEYKGKYVVFFFYPLDFTFVCPTEIIAFSDRADEFKKLNCQVIGASVDSHFCHLAWINTPKKQGGLGPMNIPLISDPKRTIAQDYGVLKADEGISFRGLFIIDDKGILRQITINDLPVGRSVDEIIRLVQAFQFTDKHGEVCPAGWKPGSDTIKPDVNKSKEYFSKQK,1,198,198,SSGNAKIGYPAPNFKATAVMPDGQFKDISLSEYKGKYVVFFFYPLDFTFVCPTEIIAFSDRADEFKKLNCQVIGASVDSHFCHLAWINTPKKQGGLGPMNIPLISDPKRTIAQDYGVLKADEGISFRGLFIIDDKGILRQITINDLPVGRSVDEIIRLVQAFQFTDKHGEVCPAGWKPGSDTIKPDVNKSKEYFSKQK,22195.29751569,22209.36588,,RESID:51@0|RESID:38@88|RESID:55@195,,,1
9433,PRDX1_MOUSE,P35700,Peroxiredoxin-1,P35700,,MSSGNAKIGYPAPNFKATAVMPDGQFKDISLSEYKGKYVVFFFYPLDFTFVCPTEIIAFSDRADEFKKLNCQVIGASVDSHFCHLAWINTPKKQGGLGPMNIPLISDPKRTIAQDYGVLKADEGISFRGLFIIDDKGILRQITINDLPVGRSVDEIIRLVQAFQFTDKHGEVCPAGWKPGSDTIKPDVNKSKEYFSKQK,1,198,198,SSGNAKIGYPAPNFKATAVMPDGQFKDISLSEYKGKYVVFFFYPLDFTFVCPTEIIAFSDRADEFKKLNCQVIGASVDSHFCHLAWINTPKKQGGLGPMNIPLISDPKRTIAQDYGVLKADEGISFRGLFIIDDKGILRQITINDLPVGRSVDEIIRLVQAFQFTDKHGEVCPAGWKPGSDTIKPDVNKSKEYFSKQK,22317.27441169,22331.38588,,RESID:51@0|RESID:39@8|RESID:55@14|RESID:55@25|RESID:38@88,,,1
9474,PRDX1_MOUSE,P35700,Peroxiredoxin-1,P35700,,MSSGNAKIGYPAPNFKATAVMPDGQFKDISLSEYKGKYVVFFFYPLDFTFVCPTEIIAFSDRADEFKKLNCQVIGASVDSHFCHLAWINTPKKQGGLGPMNIPLISDPKRTIAQDYGVLKADEGISFRGLFIIDDKGILRQITINDLPVGRSVDEIIRLVQAFQFTDKHGEVCPAGWKPGSDTIKPDVNKSKEYFSKQK,1,198,198,SSGNAKIGYPAPNFKATAVMPDGQFKDISLSEYKGKYVVFFFYPLDFTFVCPTEIIAFSDRADEFKKLNCQVIGASVDSHFCHLAWINTPKKQGGLGPMNIPLISDPKRTIAQDYGVLKADEGISFRGLFIIDDKGILRQITINDLPVGRSVDEIIRLVQAFQFTDKHGEVCPAGWKPGSDTIKPDVNKSKEYFSKQK,22241.36287969,22255.50588,,RESID:51@0|RESID:55@5|RESID:55@14|RESID:55@25|RESID:55@33,,,1
9577,PRDX1_MOUSE,P35700,Peroxiredoxin-1,P35700,,MSSGNAKIGYPAPNFKATAVMPDGQFKDISLSEYKGKYVVFFFYPLDFTFVCPTEIIAFSDRADEFKKLNCQVIGASVDSHFCHLAWINTPKKQGGLGPMNIPLISDPKRTIAQDYGVLKADEGISFRGLFIIDDKGILRQITINDLPVGRSVDEIIRLVQAFQFTDKHGEVCPAGWKPGSDTIKPDVNKSKEYFSKQK,1,198,198,SSGNAKIGYPAPNFKATAVMPDGQFKDISLSEYKGKYVVFFFYPLDFTFVCPTEIIAFSDRADEFKKLNCQVIGASVDSHFCHLAWINTPKKQGGLGPMNIPLISDPKRTIAQDYGVLKADEGISFRGLFIIDDKGILRQITINDLPVGRSVDEIIRLVQAFQFTDKHGEVCPAGWKPGSDTIKPDVNKSKEYFSKQK,22111.27638569,22125.28588,,RESID:39@8,,,1
9695,PRDX1_MOUSE,P35700,Peroxiredoxin-1,P35700,,MSSGNAKIGYPAPNFKATAVMPDGQFKDISLSEYKGKYVVFFFYPLDFTFVCPTEIIAFSDRADEFKKLNCQVIGASVDSHFCHLAWINTPKKQGGLGPMNIPLISDPKRTIAQDYGVLKADEGISFRGLFIIDDKGILRQITINDLPVGRSVDEIIRLVQAFQFTDKHGEVCPAGWKPGSDTIKPDVNKSKEYFSKQK,0,198,199,MSSGNAKIGYPAPNFKATAVMPDGQFKDISLSEYKGKYVVFFFYPLDFTFVCPTEIIAFSDRADEFKKLNCQVIGASVDSHFCHLAWINTPKKQGGLGPMNIPLISDPKRTIAQDYGVLKADEGISFRGLFIIDDKGILRQITINDLPVGRSVDEIIRLVQAFQFTDKHGEVCPAGWKPGSDTIKPDVNKSKEYFSKQK,22246.37167469,22260.57848,,RESID:49@0|RESID:55@26,,,1
9747,PRDX1_MOUSE,P35700,Peroxiredoxin-1,P35700,,MSSGNAKIGYPAPNFKATAVMPDGQFKDISLSEYKGKYVVFFFYPLDFTFVCPTEIIAFSDRADEFKKLNCQVIGASVDSHFCHLAWINTPKKQGGLGPMNIPLISDPKRTIAQDYGVLKADEGISFRGLFIIDDKGILRQITINDLPVGRSVDEIIRLVQAFQFTDKHGEVCPAGWKPGSDTIKPDVNKSKEYFSKQK,1,198,198,SSGNAKIGYPAPNFKATAVMPDGQFKDISLSEYKGKYVVFFFYPLDFTFVCPTEIIAFSDRADEFKKLNCQVIGASVDSHFCHLAWINTPKKQGGLGPMNIPLISDPKRTIAQDYGVLKADEGISFRGLFIIDDKGILRQITINDLPVGRSVDEIIRLVQAFQFTDKHGEVCPAGWKPGSDTIKPDVNKSKEYFSKQK,22321.32921069,22335.48588,,RESID:51@0|RESID:55@5|RESID:55@14|RESID:55@25|RESID:55@33|RESID:38@88,,,1
9877,PRDX1_MOUSE,P35700,Peroxiredoxin-1,P35700,,MSSGNAKIGYPAPNFKATAVMPDGQFKDISLSEYKGKYVVFFFYPLDFTFVCPTEIIAFSDRADEFKKLNCQVIGASVDSHFCHLAWINTPKKQGGLGPMNIPLISDPKRTIAQDYGVLKADEGISFRGLFIIDDKGILRQITINDLPVGRSVDEIIRLVQAFQFTDKHGEVCPAGWKPGSDTIKPDVNKSKEYFSKQK,0,198,199,MSSGNAKIGYPAPNFKATAVMPDGQFKDISLSEYKGKYVVFFFYPLDFTFVCPTEIIAFSDRADEFKKLNCQVIGASVDSHFCHLAWINTPKKQGGLGPMNIPLISDPKRTIAQDYGVLKADEGISFRGLFIIDDKGILRQITINDLPVGRSVDEIIRLVQAFQFTDKHGEVCPAGWKPGSDTIKPDVNKSKEYFSKQK,22330.39280469,22344.65848,,RESID:49@0|RESID:55@6|RESID:55@15|RESID:55@26,,,1
9989,PRDX1_MOUSE,P35700,Peroxiredoxin-1,P35700,,MSSGNAKIGYPAPNFKATAVMPDGQFKDISLSEYKGKYVVFFFYPLDFTFVCPTEIIAFSDRADEFKKLNCQVIGASVDSHFCHLAWINTPKKQGGLGPMNIPLISDPKRTIAQDYGVLKADEGISFRGLFIIDDKGILRQITINDLPVGRSVDEIIRLVQAFQFTDKHGEVCPAGWKPGSDTIKPDVNKSKEYFSKQK,1,198,198,SSGNAKIGYPAPNFKATAVMPDGQFKDISLSEYKGKYVVFFFYPLDFTFVCPTEIIAFSDRADEFKKLNCQVIGASVDSHFCHLAWINTPKKQGGLGPMNIPLISDPKRTIAQDYGVLKADEGISFRGLFIIDDKGILRQITINDLPVGRSVDEIIRLVQAFQFTDKHGEVCPAGWKPGSDTIKPDVNKSKEYFSKQK,22115.33118469,22129.38588,,RESID:51@0|RESID:55@14,,,1
10006,PRDX1_MOUSE,P35700,Peroxiredoxin-1,P35700,,MSSGNAKIGYPAPNFKATAVMPDGQFKDISLSEYKGKYVVFFFYPLDFTFVCPTEIIAFSDRADEFKKLNCQVIGASVDSHFCHLAWINTPKKQGGLGPMNIPLISDPKRTIAQDYGVLKADEGISFRGLFIIDDKGILRQITINDLPVGRSVDEIIRLVQAFQFTDKHGEVCPAGWKPGSDTIKPDVNKSKEYFSKQK,0,198,199,MSSGNAKIGYPAPNFKATAVMPDGQFKDISLSEYKGKYVVFFFYPLDFTFVCPTEIIAFSDRADEFKKLNCQVIGASVDSHFCHLAWINTPKKQGGLGPMNIPLISDPKRTIAQDYGVLKADEGISFRGLFIIDDKGILRQITINDLPVGRSVDEIIRLVQAFQFTDKHGEVCPAGWKPGSDTIKPDVNKSKEYFSKQK,22368.34857069,22382.59848,,RESID:49@0|RESID:55@26|RESID:55@34|RESID:38@89,,,1
10025,PRDX1_MOUSE,P35700,Peroxiredoxin-1,P35700,,MSSGNAKIGYPAPNFKATAVMPDGQFKDISLSEYKGKYVVFFFYPLDFTFVCPTEIIAFSDRADEFKKLNCQVIGASVDSHFCHLAWINTPKKQGGLGPMNIPLISDPKRTIAQDYGVLKADEGISFRGLFIIDDKGILRQITINDLPVGRSVDEIIRLVQAFQFTDKHGEVCPAGWKPGSDTIKPDVNKSKEYFSKQK,1,198,198,SSGNAKIGYPAPNFKATAVMPDGQFKDISLSEYKGKYVVFFFYPLDFTFVCPTEIIAFSDRADEFKKLNCQVIGASVDSHFCHLAWINTPKKQGGLGPMNIPLISDPKRTIAQDYGVLKADEGISFRGLFIIDDKGILRQITINDLPVGRSVDEIIRLVQAFQFTDKHGEVCPAGWKPGSDTIKPDVNKSKEYFSKQK,22321.32921069,22335.48588,,RESID:51@0|RESID:55@5|RESID:39@8|RESID:55@14|RESID:55@25|RESID:55@33,,,1
10144,PRDX1_MOUSE,P35700,Peroxiredoxin-1,P35700,,MSSGNAKIGYPAPNFKATAVMPDGQFKDISLSEYKGKYVVFFFYPLDFTFVCPTEIIAFSDRADEFKKLNCQVIGASVDSHFCHLAWINTPKKQGGLGPMNIPLISDPKRTIAQDYGVLKADEGISFRGLFIIDDKGILRQITINDLPVGRSVDEIIRLVQAFQFTDKHGEVCPAGWKPGSDTIKPDVNKSKEYFSKQK,0,198,199,MSSGNAKIGYPAPNFKATAVMPDGQFKDISLSEYKGKYVVFFFYPLDFTFVCPTEIIAFSDRADEFKKLNCQVIGASVDSHFCHLAWINTPKKQGGLGPMNIPLISDPKRTIAQDYGVLKADEGISFRGLFIIDDKGILRQITINDLPVGRSVDEIIRLVQAFQFTDKHGEVCPAGWKPGSDTIKPDVNKSKEYFSKQK,22284.32744069,22298.51848,,RESID:49@0|RESID:38@89,,,1
