PFR,UniProt Id,Entry Accession,Entry Description,Isoform Accession,Isoform Description,Isoform Sequence,Start,End,Length,Proteoform Sequence,Monoisotopic Mass,Average Mass,Sequence Modifications,PTMs,N-Terminal,C-Terminal,Star
1030,TAGL2_HUMAN,P37802,Transgelin-2,P37802-1,1,MANRGPAYGLSREVQQKIEKQYDADLEQILIQWITTQCRKDVGRPQPGRENFQNWLKDGTVLCELINALYPEGQAPVKKIQASTMAFKQMEQISQFLQAAERYGINTTDIFQTVDLWEGKNMACVQRTLMNLGGLAVARDDGLFSGDPNWFPKKSKENPRNFSDNQLQEGKNVIGLQMGTNRGASQAGMTGYGMPRQIL,1,198,198,ANRGPAYGLSREVQQKIEKQYDADLEQILIQWITTQCRKDVGRPQPGRENFQNWLKDGTVLCELINALYPEGQAPVKKIQASTMAFKQMEQISQFLQAAERYGINTTDIFQTVDLWEGKNMACVQRTLMNLGGLAVARDDGLFSGDPNWFPKKSKENPRNFSDNQLQEGKNVIGLQMGTNRGASQAGMTGYGMPRQIL,22288.14280969,22302.29378,,RESID:41@0,,,1
1039,TAGL2_HUMAN,P37802,Transgelin-2,P37802-1,1,MANRGPAYGLSREVQQKIEKQYDADLEQILIQWITTQCRKDVGRPQPGRENFQNWLKDGTVLCELINALYPEGQAPVKKIQASTMAFKQMEQISQFLQAAERYGINTTDIFQTVDLWEGKNMACVQRTLMNLGGLAVARDDGLFSGDPNWFPKKSKENPRNFSDNQLQEGKNVIGLQMGTNRGASQAGMTGYGMPRQIL,1,198,198,ANRGPAYGLSREVQQKIEKQYDADLEQILIQWITTQCRKDVGRPQPGRENFQNWLKDGTVLCELINALYPEGQAPVKKIQASTMAFKQMEQISQFLQAAERYGINTTDIFQTVDLWEGKNMACVQRTLMNLGGLAVARDDGLFSGDPNWFPKKSKENPRNFSDNQLQEGKNVIGLQMGTNRGASQAGMTGYGMPRQIL,22368.10914069,22382.27378,,RESID:41@0|RESID:37@161,,,1
1216,TAGL2_HUMAN,P37802,Transgelin-2,P37802-1,1,MANRGPAYGLSREVQQKIEKQYDADLEQILIQWITTQCRKDVGRPQPGRENFQNWLKDGTVLCELINALYPEGQAPVKKIQASTMAFKQMEQISQFLQAAERYGINTTDIFQTVDLWEGKNMACVQRTLMNLGGLAVARDDGLFSGDPNWFPKKSKENPRNFSDNQLQEGKNVIGLQMGTNRGASQAGMTGYGMPRQIL,1,198,198,ANRGPAYGLSREVQQKIEKQYDADLEQILIQWITTQCRKDVGRPQPGRENFQNWLKDGTVLCELINALYPEGQAPVKKIQASTMAFKQMEQISQFLQAAERYGINTTDIFQTVDLWEGKNMACVQRTLMNLGGLAVARDDGLFSGDPNWFPKKSKENPRNFSDNQLQEGKNVIGLQMGTNRGASQAGMTGYGMPRQIL,22448.07547169,22462.25378,,RESID:41@0|RESID:37@161|RESID:37@183,,,1
1284,TAGL2_HUMAN,P37802,Transgelin-2,P37802-1,1,MANRGPAYGLSREVQQKIEKQYDADLEQILIQWITTQCRKDVGRPQPGRENFQNWLKDGTVLCELINALYPEGQAPVKKIQASTMAFKQMEQISQFLQAAERYGINTTDIFQTVDLWEGKNMACVQRTLMNLGGLAVARDDGLFSGDPNWFPKKSKENPRNFSDNQLQEGKNVIGLQMGTNRGASQAGMTGYGMPRQIL,1,198,198,ANRGPAYGLSREVQQKIEKQYDADLEQILIQWITTQCRKDVGRPQPGRENFQNWLKDGTVLCELINALYPEGQAPVKKIQASTMAFKQMEQISQFLQAAERYGINTTDIFQTVDLWEGKNMACVQRTLMNLGGLAVARDDGLFSGDPNWFPKKSKENPRNFSDNQLQEGKNVIGLQMGTNRGASQAGMTGYGMPRQIL,22330.15337469,22344.33378,,RESID:41@0|RESID:55@18,,,1
1451,TAGL2_HUMAN,P37802,Transgelin-2,P37802-1,1,MANRGPAYGLSREVQQKIEKQYDADLEQILIQWITTQCRKDVGRPQPGRENFQNWLKDGTVLCELINALYPEGQAPVKKIQASTMAFKQMEQISQFLQAAERYGINTTDIFQTVDLWEGKNMACVQRTLMNLGGLAVARDDGLFSGDPNWFPKKSKENPRNFSDNQLQEGKNVIGLQMGTNRGASQAGMTGYGMPRQIL,1,198,198,ANRGPAYGLSREVQQKIEKQYDADLEQILIQWITTQCRKDVGRPQPGRENFQNWLKDGTVLCELINALYPEGQAPVKKIQASTMAFKQMEQISQFLQAAERYGINTTDIFQTVDLWEGKNMACVQRTLMNLGGLAVARDDGLFSGDPNWFPKKSKENPRNFSDNQLQEGKNVIGLQMGTNRGASQAGMTGYGMPRQIL,22410.11970569,22424.31378,,RESID:41@0|RESID:55@18|RESID:37@161,,,1
1694,TAGL2_HUMAN,P37802,Transgelin-2,P37802-1,1,MANRGPAYGLSREVQQKIEKQYDADLEQILIQWITTQCRKDVGRPQPGRENFQNWLKDGTVLCELINALYPEGQAPVKKIQASTMAFKQMEQISQFLQAAERYGINTTDIFQTVDLWEGKNMACVQRTLMNLGGLAVARDDGLFSGDPNWFPKKSKENPRNFSDNQLQEGKNVIGLQMGTNRGASQAGMTGYGMPRQIL,1,198,198,ANRGPAYGLSREVQQKIEKQYDADLEQILIQWITTQCRKDVGRPQPGRENFQNWLKDGTVLCELINALYPEGQAPVKKIQASTMAFKQMEQISQFLQAAERYGINTTDIFQTVDLWEGKNMACVQRTLMNLGGLAVARDDGLFSGDPNWFPKKSKENPRNFSDNQLQEGKNVIGLQMGTNRGASQAGMTGYGMPRQIL,22372.16393969,22386.37378,,RESID:41@0|RESID:55@15|RESID:55@18,,,1
1718,TAGL2_HUMAN,P37802,Transgelin-2,P37802-1,1,MANRGPAYGLSREVQQKIEKQYDADLEQILIQWITTQCRKDVGRPQPGRENFQNWLKDGTVLCELINALYPEGQAPVKKIQASTMAFKQMEQISQFLQAAERYGINTTDIFQTVDLWEGKNMACVQRTLMNLGGLAVARDDGLFSGDPNWFPKKSKENPRNFSDNQLQEGKNVIGLQMGTNRGASQAGMTGYGMPRQIL,1,198,198,ANRGPAYGLSREVQQKIEKQYDADLEQILIQWITTQCRKDVGRPQPGRENFQNWLKDGTVLCELINALYPEGQAPVKKIQASTMAFKQMEQISQFLQAAERYGINTTDIFQTVDLWEGKNMACVQRTLMNLGGLAVARDDGLFSGDPNWFPKKSKENPRNFSDNQLQEGKNVIGLQMGTNRGASQAGMTGYGMPRQIL,22528.04180269,22542.23378,,RESID:41@0|RESID:37@161|RESID:37@183|RESID:39@190,,,1
1766,TAGL2_HUMAN,P37802,Transgelin-2,P37802-1,1,MANRGPAYGLSREVQQKIEKQYDADLEQILIQWITTQCRKDVGRPQPGRENFQNWLKDGTVLCELINALYPEGQAPVKKIQASTMAFKQMEQISQFLQAAERYGINTTDIFQTVDLWEGKNMACVQRTLMNLGGLAVARDDGLFSGDPNWFPKKSKENPRNFSDNQLQEGKNVIGLQMGTNRGASQAGMTGYGMPRQIL,1,198,198,ANRGPAYGLSREVQQKIEKQYDADLEQILIQWITTQCRKDVGRPQPGRENFQNWLKDGTVLCELINALYPEGQAPVKKIQASTMAFKQMEQISQFLQAAERYGINTTDIFQTVDLWEGKNMACVQRTLMNLGGLAVARDDGLFSGDPNWFPKKSKENPRNFSDNQLQEGKNVIGLQMGTNRGASQAGMTGYGMPRQIL,22326.09857569,22340.23378,,RESID:39@6,,,1
2313,TAGL2_HUMAN,P37802,Transgelin-2,P37802-1,1,MANRGPAYGLSREVQQKIEKQYDADLEQILIQWITTQCRKDVGRPQPGRENFQNWLKDGTVLCELINALYPEGQAPVKKIQASTMAFKQMEQISQFLQAAERYGINTTDIFQTVDLWEGKNMACVQRTLMNLGGLAVARDDGLFSGDPNWFPKKSKENPRNFSDNQLQEGKNVIGLQMGTNRGASQAGMTGYGMPRQIL,0,198,199,MANRGPAYGLSREVQQKIEKQYDADLEQILIQWITTQCRKDVGRPQPGRENFQNWLKDGTVLCELINALYPEGQAPVKKIQASTMAFKQMEQISQFLQAAERYGINTTDIFQTVDLWEGKNMACVQRTLMNLGGLAVARDDGLFSGDPNWFPKKSKENPRNFSDNQLQEGKNVIGLQMGTNRGASQAGMTGYGMPRQIL,22461.19386469,22475.52638,,RESID:49@0|RESID:41@1,,,1
2333,TAGL2_HUMAN,P37802,Transgelin-2,P37802-1,1,MANRGPAYGLSREVQQKIEKQYDADLEQILIQWITTQCRKDVGRPQPGRENFQNWLKDGTVLCELINALYPEGQAPVKKIQASTMAFKQMEQISQFLQAAERYGINTTDIFQTVDLWEGKNMACVQRTLMNLGGLAVARDDGLFSGDPNWFPKKSKENPRNFSDNQLQEGKNVIGLQMGTNRGASQAGMTGYGMPRQIL,0,198,199,MANRGPAYGLSREVQQKIEKQYDADLEQILIQWITTQCRKDVGRPQPGRENFQNWLKDGTVLCELINALYPEGQAPVKKIQASTMAFKQMEQISQFLQAAERYGINTTDIFQTVDLWEGKNMACVQRTLMNLGGLAVARDDGLFSGDPNWFPKKSKENPRNFSDNQLQEGKNVIGLQMGTNRGASQAGMTGYGMPRQIL,22377.17273469,22391.44638,,,,,1
4070,TAGL2_HUMAN,P37802,Transgelin-2,P37802-1,1,MANRGPAYGLSREVQQKIEKQYDADLEQILIQWITTQCRKDVGRPQPGRENFQNWLKDGTVLCELINALYPEGQAPVKKIQASTMAFKQMEQISQFLQAAERYGINTTDIFQTVDLWEGKNMACVQRTLMNLGGLAVARDDGLFSGDPNWFPKKSKENPRNFSDNQLQEGKNVIGLQMGTNRGASQAGMTGYGMPRQIL,1,198,198,ANRGPAYGLSREVQQKIEKQYDADLEQILIQWITTQCRKDVGRPQPGRENFQNWLKDGTVLCELINALYPEGQAPVKKIQASTMAFKQMEQISQFLQAAERYGINTTDIFQTVDLWEGKNMACVQRTLMNLGGLAVARDDGLFSGDPNWFPKKSKENPRNFSDNQLQEGKNVIGLQMGTNRGASQAGMTGYGMPRQIL,22288.14280969,22302.29378,,RESID:55@15,,,1
6097,TAGL2_HUMAN,P37802,Transgelin-2,P37802-1,1,MANRGPAYGLSREVQQKIEKQYDADLEQILIQWITTQCRKDVGRPQPGRENFQNWLKDGTVLCELINALYPEGQAPVKKIQASTMAFKQMEQISQFLQAAERYGINTTDIFQTVDLWEGKNMACVQRTLMNLGGLAVARDDGLFSGDPNWFPKKSKENPRNFSDNQLQEGKNVIGLQMGTNRGASQAGMTGYGMPRQIL,1,198,198,ANRGPAYGLSREVQQKIEKQYDADLEQILIQWITTQCRKDVGRPQPGRENFQNWLKDGTVLCELINALYPEGQAPVKKIQASTMAFKQMEQISQFLQAAERYGINTTDIFQTVDLWEGKNMACVQRTLMNLGGLAVARDDGLFSGDPNWFPKKSKENPRNFSDNQLQEGKNVIGLQMGTNRGASQAGMTGYGMPRQIL,22368.10914069,22382.27378,,RESID:41@0|RESID:39@190,,,1
7893,TAGL2_HUMAN,P37802,Transgelin-2,P37802-1,1,MANRGPAYGLSREVQQKIEKQYDADLEQILIQWITTQCRKDVGRPQPGRENFQNWLKDGTVLCELINALYPEGQAPVKKIQASTMAFKQMEQISQFLQAAERYGINTTDIFQTVDLWEGKNMACVQRTLMNLGGLAVARDDGLFSGDPNWFPKKSKENPRNFSDNQLQEGKNVIGLQMGTNRGASQAGMTGYGMPRQIL,1,198,198,ANRGPAYGLSREVQQKIEKQYDADLEQILIQWITTQCRKDVGRPQPGRENFQNWLKDGTVLCELINALYPEGQAPVKKIQASTMAFKQMEQISQFLQAAERYGINTTDIFQTVDLWEGKNMACVQRTLMNLGGLAVARDDGLFSGDPNWFPKKSKENPRNFSDNQLQEGKNVIGLQMGTNRGASQAGMTGYGMPRQIL,22448.07547169,22462.25378,,RESID:55@18|RESID:37@161|RESID:37@183,,,1
13878,TAGL2_HUMAN,P37802,Transgelin-2,P37802-1,1,MANRGPAYGLSREVQQKIEKQYDADLEQILIQWITTQCRKDVGRPQPGRENFQNWLKDGTVLCELINALYPEGQAPVKKIQASTMAFKQMEQISQFLQAAERYGINTTDIFQTVDLWEGKNMACVQRTLMNLGGLAVARDDGLFSGDPNWFPKKSKENPRNFSDNQLQEGKNVIGLQMGTNRGASQAGMTGYGMPRQIL,1,198,198,ANRGPAYGLSREVQQKIEKQYDADLEQILIQWITTQCRKDVGRPQPGRENFQNWLKDGTVLCELINAQYPEGQAPVKKIQASTMAFKQMEQISQFLQAAERYGINTTDIFQTVDLWEGKNMACVQRTLMNLGGLAVARDDGLFSGDPNWFPKKSKENPRNFSDNQLQEGKNVIGLQMGTNRGASQAGMTGYGMPRQIL,22383.08366069,22397.24508,PSI-MOD:16@68,RESID:55@18|RESID:37@161,,,1
13893,TAGL2_HUMAN,P37802,Transgelin-2,P37802-1,1,MANRGPAYGLSREVQQKIEKQYDADLEQILIQWITTQCRKDVGRPQPGRENFQNWLKDGTVLCELINALYPEGQAPVKKIQASTMAFKQMEQISQFLQAAERYGINTTDIFQTVDLWEGKNMACVQRTLMNLGGLAVARDDGLFSGDPNWFPKKSKENPRNFSDNQLQEGKNVIGLQMGTNRGASQAGMTGYGMPRQIL,1,198,198,ANRGPAYGLSREVQQKIEKQYDADLEQILIQWITTQCRKDVGRPQPGRENFQNWLKDGTVLCELINAQYPEGQAPVKKIQASTMAFKQMEQISQFLQAAERYGINTTDIFQTVDLWEGKNMACVQRTLMNLGGLAVARDDGLFSGDPNWFPKKSKENPRNFSDNQLQEGKNVIGLQMGTNRGASQAGMTGYGMPRQIL,22383.08366069,22397.24508,PSI-MOD:16@68,RESID:41@0|RESID:37@161,,,1
14896,TAGL2_HUMAN,P37802,Transgelin-2,P37802-1,1,MANRGPAYGLSREVQQKIEKQYDADLEQILIQWITTQCRKDVGRPQPGRENFQNWLKDGTVLCELINALYPEGQAPVKKIQASTMAFKQMEQISQFLQAAERYGINTTDIFQTVDLWEGKNMACVQRTLMNLGGLAVARDDGLFSGDPNWFPKKSKENPRNFSDNQLQEGKNVIGLQMGTNRGASQAGMTGYGMPRQIL,1,198,198,ANRGPAYGLSREVQQKIEKQYDADLEQILIQWITTQCRKDVGRPQPGRENFQNWLKDGTVLCELINAQYPEGQAPVKKIQASTMAFKQMEQISQFLQAAERYGINTTDIFQTVDLWEGKNMACVQRTLMNLGGLAVARDDGLFSGDPNWFPKKSKENPRNFSDNQLQEGKNVIGLQMGTNRGASQAGMTGYGMPRQIL,22303.11732969,22317.26508,PSI-MOD:16@68,RESID:41@0,,,1
15983,TAGL2_HUMAN,P37802,Transgelin-2,P37802-1,1,MANRGPAYGLSREVQQKIEKQYDADLEQILIQWITTQCRKDVGRPQPGRENFQNWLKDGTVLCELINALYPEGQAPVKKIQASTMAFKQMEQISQFLQAAERYGINTTDIFQTVDLWEGKNMACVQRTLMNLGGLAVARDDGLFSGDPNWFPKKSKENPRNFSDNQLQEGKNVIGLQMGTNRGASQAGMTGYGMPRQIL,1,198,198,ANRGPAYGLSREVQQKIEKQYDADLEQILIQWITTQCRKDVGRPQPGRENFQNWLKDGTVLCELINALYPEGQAPVKKIQASTMAFKQMEQISQFLQAAERYGINTTDIFQTVDLWEGKNMACVQRTLMNLGGLAVARDDGLFSGDPNWFPKKSKENPRNFSDNQLQEGKNVIGLQMGTNRGASQAGMTGYGMPRQIL,22288.14281,22302.29378,,,PSI-MOD:1458,,0
