PFR,UniProt Id,Entry Accession,Entry Description,Isoform Accession,Isoform Description,Isoform Sequence,Start,End,Length,Proteoform Sequence,Monoisotopic Mass,Average Mass,Sequence Modifications,PTMs,N-Terminal,C-Terminal,Star
1112,IPP2_HUMAN,P41236,Protein phosphatase inhibitor 2,P41236,,MAASTASHRPIKGILKNKTSTTSSMVASAEQPRGNVDEELSKKSQKWDEMNILATYHPADKDYGLMKIDEPSTPYHSMMGDDEDACSDTEATEAMAPDILARKLAAAEGLEPKYRIQEQESSGEEDSDLSPEEREKKRQFEMKRKLHYNEGLNIKLARQLISKDLHDDDEDEEMLETADGESMNTEESNQGSTPSDQQQNKLRSS,1,204,204,AASTASHRPIKGILKNKTSTTSSMVASAEQPRGNVDEELSKKSQKWDEMNILATYHPADKDYGLMKIDEPSTPYHSMMGDDEDACSDTEATEAMAPDILARKLAAAEGLEPKYRIQEQESSGEEDSDLSPEEREKKRQFEMKRKLHYNEGLNIKLARQLISKDLHDDDEDEEMLETADGESMNTEESNQGSTPSDQQQNKLRSS,22911.82458969,22926.03868,,RESID:41@0,,,1
1186,IPP2_HUMAN,P41236,Protein phosphatase inhibitor 2,P41236,,MAASTASHRPIKGILKNKTSTTSSMVASAEQPRGNVDEELSKKSQKWDEMNILATYHPADKDYGLMKIDEPSTPYHSMMGDDEDACSDTEATEAMAPDILARKLAAAEGLEPKYRIQEQESSGEEDSDLSPEEREKKRQFEMKRKLHYNEGLNIKLARQLISKDLHDDDEDEEMLETADGESMNTEESNQGSTPSDQQQNKLRSS,1,204,204,AASTASHRPIKGILKNKTSTTSSMVASAEQPRGNVDEELSKKSQKWDEMNILATYHPADKDYGLMKIDEPSTPYHSMMGDDEDACSDTEATEAMAPDILARKLAAAEGLEPKYRIQEQESSGEEDSDLSPEEREKKRQFEMKRKLHYNEGLNIKLARQLISKDLHDDDEDEEMLETADGESMNTEESNQGSTPSDQQQNKLRSS,23071.75725169,23085.99868,,RESID:41@0|RESID:37@85|RESID:38@87,,,1
1938,IPP2_HUMAN,P41236,Protein phosphatase inhibitor 2,P41236,,MAASTASHRPIKGILKNKTSTTSSMVASAEQPRGNVDEELSKKSQKWDEMNILATYHPADKDYGLMKIDEPSTPYHSMMGDDEDACSDTEATEAMAPDILARKLAAAEGLEPKYRIQEQESSGEEDSDLSPEEREKKRQFEMKRKLHYNEGLNIKLARQLISKDLHDDDEDEEMLETADGESMNTEESNQGSTPSDQQQNKLRSS,1,204,204,AASTASHRPIKGILKNKTSTTSSMVASAEQPRGNVDEELSKKSQKWDEMNILATYHPADKDYGLMKIDEPSTPYHSMMGDDEDACSDTEATEAMAPDILARKLAAAEGLEPKYRIQEQESSGEEDSDLSPEEREKKRQFEMKRKLHYNEGLNIKLARQLISKDLHDDDEDEEMLETADGESMNTEESNQGSTPSDQQQNKLRSS,23071.75725169,23085.99868,,RESID:41@0|RESID:37@85|RESID:38@90,,,1
2242,IPP2_HUMAN,P41236,Protein phosphatase inhibitor 2,P41236,,MAASTASHRPIKGILKNKTSTTSSMVASAEQPRGNVDEELSKKSQKWDEMNILATYHPADKDYGLMKIDEPSTPYHSMMGDDEDACSDTEATEAMAPDILARKLAAAEGLEPKYRIQEQESSGEEDSDLSPEEREKKRQFEMKRKLHYNEGLNIKLARQLISKDLHDDDEDEEMLETADGESMNTEESNQGSTPSDQQQNKLRSS,1,204,204,AASTASHRPIKGILKNKTSTTSSMVASAEQPRGNVDEELSKKSQKWDEMNILATYHPADKDYGLMKIDEPSTPYHSMMGDDEDACSDTEATEAMAPDILARKLAAAEGLEPKYRIQEQESSGEEDSDLSPEEREKKRQFEMKRKLHYNEGLNIKLARQLISKDLHDDDEDEEMLETADGESMNTEESNQGSTPSDQQQNKLRSS,22869.81402469,22883.99868,,,,,1
14217,IPP2_HUMAN,P41236,Protein phosphatase inhibitor 2,P41236,,MAASTASHRPIKGILKNKTSTTSSMVASAEQPRGNVDEELSKKSQKWDEMNILATYHPADKDYGLMKIDEPSTPYHSMMGDDEDACSDTEATEAMAPDILARKLAAAEGLEPKYRIQEQESSGEEDSDLSPEEREKKRQFEMKRKLHYNEGLNIKLARQLISKDLHDDDEDEEMLETADGESMNTEESNQGSTPSDQQQNKLRSS,1,204,204,AASTASHRPIKGILKNKTSTTSSMVASAEQPRGNVDEELSKKSQKWDEMNILATYHPADKDYGLMKIDEPSTPYHSMMGDDEDACSDTEATEAMAPDILARKLAAAEGLEPKYRIQEQESSGEEDSDLSPEEREKKRQFEMKRKLHYNEGLNIKLARQLISKDLHDDDEDEEMLETADGESMNTEESNQGSTPSDQQQNKLRSS,23071.75725169,23085.99868,,RESID:41@0|RESID:38@87|RESID:38@90,,,1
14218,IPP2_HUMAN,P41236,Protein phosphatase inhibitor 2,P41236,,MAASTASHRPIKGILKNKTSTTSSMVASAEQPRGNVDEELSKKSQKWDEMNILATYHPADKDYGLMKIDEPSTPYHSMMGDDEDACSDTEATEAMAPDILARKLAAAEGLEPKYRIQEQESSGEEDSDLSPEEREKKRQFEMKRKLHYNEGLNIKLARQLISKDLHDDDEDEEMLETADGESMNTEESNQGSTPSDQQQNKLRSS,1,204,204,AASTASHRPIKGILKNKTSTTSSMVASAEQPRGNVDEELSKKSQKWDEMNILATYHPADKDYGLMKIDEPSTPYHSMMGDDEDACSDTEATEAMAPDILARKLAAAEGLEPKYRIQEQESSGEEDSDLSPEEREKKRQFEMKRKLHYNEGLNIKLARQLISKDLHDDDEDEEMLETADGESMNTEESNQGSTPSDQQQNKLRSS,23231.68991369,23245.95868,,RESID:41@0|RESID:38@71|RESID:37@85|RESID:38@87|RESID:37@119,,,1
14219,IPP2_HUMAN,P41236,Protein phosphatase inhibitor 2,P41236,,MAASTASHRPIKGILKNKTSTTSSMVASAEQPRGNVDEELSKKSQKWDEMNILATYHPADKDYGLMKIDEPSTPYHSMMGDDEDACSDTEATEAMAPDILARKLAAAEGLEPKYRIQEQESSGEEDSDLSPEEREKKRQFEMKRKLHYNEGLNIKLARQLISKDLHDDDEDEEMLETADGESMNTEESNQGSTPSDQQQNKLRSS,1,204,204,AASTASHRPIKGILKNKTSTTSSMVASAEQPRGNVDEELSKKSQKWDEMNILATYHPADKDYGLMKIDEPSTPYHSMMGDDEDACSDTEATEAMAPDILARKLAAAEGLEPKYRIQEQESSGEEDSDLSPEEREKKRQFEMKRKLHYNEGLNIKLARQLISKDLHDDDEDEEMLETADGESMNTEESNQGSTPSDQQQNKLRSS,23151.72358269,23165.97868,,RESID:41@0|RESID:38@71|RESID:37@85|RESID:38@87,,,1
14433,IPP2_HUMAN,P41236,Protein phosphatase inhibitor 2,P41236,,MAASTASHRPIKGILKNKTSTTSSMVASAEQPRGNVDEELSKKSQKWDEMNILATYHPADKDYGLMKIDEPSTPYHSMMGDDEDACSDTEATEAMAPDILARKLAAAEGLEPKYRIQEQESSGEEDSDLSPEEREKKRQFEMKRKLHYNEGLNIKLARQLISKDLHDDDEDEEMLETADGESMNTEESNQGSTPSDQQQNKLRSS,1,204,204,AASTASHRPIKGILKNKTSTTSSMVASAEQPRGNVDEELSKKSQKWDEMNILATYHPADKDYGLMKIDEPSTPYHSMMGDDEDACSDTEATEAMAPDILARKLAAAEGLEPKYRIQEQESSGEEDSDLSPEEREKKRQFEMKRKLHYNEGLNIKLARQLISKDLHDDDEDEEMLETADGESMNTEESNQGSTPSDQQQNKLRSS,23071.75725169,23085.99868,,RESID:41@0|RESID:38@71|RESID:38@87,,,1
14434,IPP2_HUMAN,P41236,Protein phosphatase inhibitor 2,P41236,,MAASTASHRPIKGILKNKTSTTSSMVASAEQPRGNVDEELSKKSQKWDEMNILATYHPADKDYGLMKIDEPSTPYHSMMGDDEDACSDTEATEAMAPDILARKLAAAEGLEPKYRIQEQESSGEEDSDLSPEEREKKRQFEMKRKLHYNEGLNIKLARQLISKDLHDDDEDEEMLETADGESMNTEESNQGSTPSDQQQNKLRSS,1,204,204,AASTASHRPIKGILKNKTSTTSSMVASAEQPRGNVDEELSKKSQKWDEMNILATYHPADKDYGLMKIDEPSTPYHSMMGDDEDACSDTEATEAMAPDILARKLAAAEGLEPKYRIQEQESSGEEDSDLSPEEREKKRQFEMKRKLHYNEGLNIKLARQLISKDLHDDDEDEEMLETADGESMNTEESNQGSTPSDQQQNKLRSS,23231.68991369,23245.95868,,RESID:41@0|RESID:38@71|RESID:37@85|RESID:38@87|RESID:38@90,,,1
