PFR,UniProt Id,Entry Accession,Entry Description,Isoform Accession,Isoform Description,Isoform Sequence,Start,End,Length,Proteoform Sequence,Monoisotopic Mass,Average Mass,Sequence Modifications,PTMs,N-Terminal,C-Terminal,Star
2714,RS27_HUMAN,P42677,40S ribosomal protein S27,P42677,,MPLAKDLLHPSPEEEKRKHKKKRLVQSPNSYFMDVKCPGCYKITTVFSHAQTVVLCVGCSTVLCQPTGGKARLTEGCSFRRKQH,1,83,83,PLAKDLLHPSPEEEKRKHKKKRLVQSPNSYFMDVKCPGCYKITTVFSHAQTVVLCVGCSTVLCQPTGGKARLTEGCSFRRKQH,9323.79516469,9329.93048,,,,,1
7621,RS27_HUMAN,P42677,40S ribosomal protein S27,P42677,,MPLAKDLLHPSPEEEKRKHKKKRLVQSPNSYFMDVKCPGCYKITTVFSHAQTVVLCVGCSTVLCQPTGGKARLTEGCSFRRKQH,1,83,83,PLAKDLLHPSPEEEKRKHKKKRLVQSPNSYFMDVKCPGCYKITTVFSHAQTVVLCVGCSTVLCQPTGGKARLTEGCSFRRKQH,9403.76149569,9409.91048,,RESID:37@9,,,1
7679,RS27_HUMAN,P42677,40S ribosomal protein S27,P42677,,MPLAKDLLHPSPEEEKRKHKKKRLVQSPNSYFMDVKCPGCYKITTVFSHAQTVVLCVGCSTVLCQPTGGKARLTEGCSFRRKQH,1,83,83,PLAKDLLHPSPEEEKRKHKKKRLVQSPNSYFMDVKCPGCYKITTVFSHAQTVVLCVGCSTVLCQPTGGKARLTEGCSFRRKQH,9643.66048868999,9649.85048,,RESID:37@9|RESID:37@25|RESID:37@28|RESID:39@29,,,1
11867,RS27_HUMAN,P42677,40S ribosomal protein S27,P42677,,MPLAKDLLHPSPEEEKRKHKKKRLVQSPNSYFMDVKCPGCYKITTVFSHAQTVVLCVGCSTVLCQPTGGKARLTEGCSFRRKQH,0,83,84,MPLAKDLLHPSPEEEKRKHKKKRLVQSPNSYFMDVKCPGCYKITTVFSHAQTVVLCVGCSTVLCQPTGGKARLTEGCSFRRKQH,9496.84621969,9503.16308,,PSI-MOD:394@35,,,0
12540,RS27_HUMAN,P42677,40S ribosomal protein S27,P42677,,MPLAKDLLHPSPEEEKRKHKKKRLVQSPNSYFMDVKCPGCYKITTVFSHAQTVVLCVGCSTVLCQPTGGKARLTEGCSFRRKQH,1,83,83,PLAKDLLHPSPEEEKRKHKKKRLVQSPNSYFMDVKCPGCYKITTVFSHAQTVVLCVGCSTVLCQPTGGKARLTEGCSFRRKQH,9365.80572969,9371.97048,,RESID:50@0,,,1
12718,RS27_HUMAN,P42677,40S ribosomal protein S27,P42677,,MPLAKDLLHPSPEEEKRKHKKKRLVQSPNSYFMDVKCPGCYKITTVFSHAQTVVLCVGCSTVLCQPTGGKARLTEGCSFRRKQH,0,83,84,MPLAKDLLHPSPEEEKRKHKKKRLVQSPNSYFMDVKCPGCYKITTVFSHAQTVVLCVGCSTVLCQPTGGKARLTEGCSFRRKQH,9454.83565469,9461.12308,,,,,1
13697,RS27_HUMAN,P42677,40S ribosomal protein S27,P42677,,MPLAKDLLHPSPEEEKRKHKKKRLVQSPNSYFMDVKCPGCYKITTVFSHAQTVVLCVGCSTVLCQPTGGKARLTEGCSFRRKQH,1,83,83,PLAKDLLHPSPEEEKRKHKKKRLVQSPNSYFMDVKCPGCYKITTVFSHAQTVVLCVGCSTVLCQPTGGKARLTEGCSFRRKQH,9403.76149569,9409.91048,,RESID:39@29,,,1
14880,RS27_HUMAN,P42677,40S ribosomal protein S27,P42677,,MPLAKDLLHPSPEEEKRKHKKKRLVQSPNSYFMDVKCPGCYKITTVFSHAQTVVLCVGCSTVLCQPTGGKARLTEGCSFRRKQH,1,83,83,PLAKDLLHPSPEEEKRKHKKKRLVQSPNSYFMDVKCPGCYKITTVFSHAQTVVLCVGCSTVLCQPTGGKARLTEGCSFRRKQH,9483.72782669,9489.89048,,RESID:37@9|RESID:39@29,,,1
16870,RS27_HUMAN,P42677,40S ribosomal protein S27,P42677,,MPLAKDLLHPSPEEEKRKHKKKRLVQSPNSYFMDVKCPGCYKITTVFSHAQTVVLCVGCSTVLCQPTGGKARLTEGCSFRRKQH,1,83,83,PLAKDLLHPSPEEEKRKHKKKRLVQSPNSYFMDVKCPGCYKITTVFSHAQTVVLCVGCSTVLCQPTGGKARLTEGCSFRRKQH,9365.80573,9371.97048,,,PSI-MOD:1458,,0
73219,RS27_HUMAN,P42677,40S ribosomal protein S27,P42677,,MPLAKDLLHPSPEEEKRKHKKKRLVQSPNSYFMDVKCPGCYKITTVFSHAQTVVLCVGCSTVLCQPTGGKARLTEGCSFRRKQH,1,34,34,PLAKDLLHPSPEEEKRKHKKKRLVQSPNSYFMDV,4044.17305469,4046.70348,,,,,1
