PFR,UniProt Id,Entry Accession,Entry Description,Isoform Accession,Isoform Description,Isoform Sequence,Start,End,Length,Proteoform Sequence,Monoisotopic Mass,Average Mass,Sequence Modifications,PTMs,N-Terminal,C-Terminal,Star
9677,H13_MOUSE,P43277,Histone H1.3,P43277,,MSETAPAAPAAPAPVEKTPVKKKAKKTGAAAGKRKASGPPVSELITKAVAASKERSGVSLAALKKALAAAGYDVEKNNSRIKLGLKSLVSKGTLVQTKGTGASGSFKLNKKAASGEAKPKAKKAGAAKAKKPAGAAKKPKKATGAATPKKTAKKTPKKAKKPAAAAGAKKVSKSPKKVKAAKPKKAAKSPAKAKAPKAKASKPKASKPKATKAKKAAPRKK,0,220,221,MSETAPAAPAAPAPVEKTPVKKKAKKTGAAAGKRKASGPPVSELITKAVAASKERSGVSLAALKKALAAAGYDVEKNNSRIKLGLKSLVSKGTLVQTKGTGASGSFKLNKKAASGEAKPKAKKAGAAKAKKPAGAAKKPKKATGAATPKKTAKKTPKKAKKPAAAAGAKKVSKSPKKVKAAKPKKAAKSPAKAKAPKAKASKPKASKPKATKAKKAAPRKK,22128.13585969,22141.56368,,RESID:49@0,,,1
9678,H13_MOUSE,P43277,Histone H1.3,P43277,,MSETAPAAPAAPAPVEKTPVKKKAKKTGAAAGKRKASGPPVSELITKAVAASKERSGVSLAALKKALAAAGYDVEKNNSRIKLGLKSLVSKGTLVQTKGTGASGSFKLNKKAASGEAKPKAKKAGAAKAKKPAGAAKKPKKATGAATPKKTAKKTPKKAKKPAAAAGAKKVSKSPKKVKAAKPKKAAKSPAKAKAPKAKASKPKASKPKATKAKKAAPRKK,1,220,220,SETAPAAPAAPAPVEKTPVKKKAKKTGAAAGKRKASGPPVSELITKAVAASKERSGVSLAALKKALAAAGYDVEKNNSRIKLGLKSLVSKGTLVQTKGTGASGSFKLNKKAASGEAKPKAKKAGAAKAKKPAGAAKKPKKATGAATPKKTAKKTPKKAKKPAAAAGAKKVSKSPKKVKAAKPKKAAKSPAKAKAPKAKASKPKASKPKATKAKKAAPRKK,21997.09536969,22010.37108,,RESID:51@0,,,1
9837,H13_MOUSE,P43277,Histone H1.3,P43277,,MSETAPAAPAAPAPVEKTPVKKKAKKTGAAAGKRKASGPPVSELITKAVAASKERSGVSLAALKKALAAAGYDVEKNNSRIKLGLKSLVSKGTLVQTKGTGASGSFKLNKKAASGEAKPKAKKAGAAKAKKPAGAAKKPKKATGAATPKKTAKKTPKKAKKPAAAAGAKKVSKSPKKVKAAKPKKAAKSPAKAKAPKAKASKPKASKPKATKAKKAAPRKK,0,220,221,MSETAPAAPAAPAPVEKTPVKKKAKKTGAAAGKRKASGPPVSELITKAVAASKERSGVSLAALKKALAAAGYDVEKNNSRIKLGLKSLVSKGTLVQTKGTGASGSFKLNKKAASGEAKPKAKKAGAAKAKKPAGAAKKPKKATGAATPKKTAKKTPKKAKKPAAAAGAKKVSKSPKKVKAAKPKKAAKSPAKAKAPKAKASKPKASKPKATKAKKAAPRKK,22288.06852169,22301.52368,,RESID:49@0|RESID:38@3|RESID:37@36,,,1
9871,H13_MOUSE,P43277,Histone H1.3,P43277,,MSETAPAAPAAPAPVEKTPVKKKAKKTGAAAGKRKASGPPVSELITKAVAASKERSGVSLAALKKALAAAGYDVEKNNSRIKLGLKSLVSKGTLVQTKGTGASGSFKLNKKAASGEAKPKAKKAGAAKAKKPAGAAKKPKKATGAATPKKTAKKTPKKAKKPAAAAGAKKVSKSPKKVKAAKPKKAAKSPAKAKAPKAKASKPKASKPKATKAKKAAPRKK,1,220,220,SETAPAAPAAPAPVEKTPVKKKAKKTGAAAGKRKASGPPVSELITKAVAASKERSGVSLAALKKALAAAGYDVEKNNSRIKLGLKSLVSKGTLVQTKGTGASGSFKLNKKAASGEAKPKAKKAGAAKAKKPAGAAKKPKKATGAATPKKTAKKTPKKAKKPAAAAGAKKVSKSPKKVKAAKPKKAAKSPAKAKAPKAKASKPKASKPKATKAKKAAPRKK,21955.08480469,21968.33108,,,,,1
9899,H13_MOUSE,P43277,Histone H1.3,P43277,,MSETAPAAPAAPAPVEKTPVKKKAKKTGAAAGKRKASGPPVSELITKAVAASKERSGVSLAALKKALAAAGYDVEKNNSRIKLGLKSLVSKGTLVQTKGTGASGSFKLNKKAASGEAKPKAKKAGAAKAKKPAGAAKKPKKATGAATPKKTAKKTPKKAKKPAAAAGAKKVSKSPKKVKAAKPKKAAKSPAKAKAPKAKASKPKASKPKATKAKKAAPRKK,0,220,221,MSETAPAAPAAPAPVEKTPVKKKAKKTGAAAGKRKASGPPVSELITKAVAASKERSGVSLAALKKALAAAGYDVEKNNSRIKLGLKSLVSKGTLVQTKGTGASGSFKLNKKAASGEAKPKAKKAGAAKAKKPAGAAKKPKKATGAATPKKTAKKTPKKAKKPAAAAGAKKVSKSPKKVKAAKPKKAAKSPAKAKAPKAKASKPKASKPKATKAKKAAPRKK,22330.07908669,22343.56368,,RESID:49@0|RESID:51@1|RESID:38@3|RESID:38@17,,,1
10200,H13_MOUSE,P43277,Histone H1.3,P43277,,MSETAPAAPAAPAPVEKTPVKKKAKKTGAAAGKRKASGPPVSELITKAVAASKERSGVSLAALKKALAAAGYDVEKNNSRIKLGLKSLVSKGTLVQTKGTGASGSFKLNKKAASGEAKPKAKKAGAAKAKKPAGAAKKPKKATGAATPKKTAKKTPKKAKKPAAAAGAKKVSKSPKKVKAAKPKKAAKSPAKAKAPKAKASKPKASKPKATKAKKAAPRKK,0,220,221,MSETAPAAPAAPAPVEKTPVKKKAKKTGAAAGKRKASGPPVSELITKAVAASKERSGVSLAALKKALAAAGYDVEKNNSRIKLGLKSLVSKGTLVQTKGTGASGSFKLNKKAASGEAKPKAKKAGAAKAKKPAGAAKKPKKATGAATPKKTAKKTPKKAKKPAAAAGAKKVSKSPKKVKAAKPKKAAKSPAKAKAPKAKASKPKASKPKATKAKKAAPRKK,22128.13585969,22141.56368,,RESID:51@1,,,1
10372,H13_MOUSE,P43277,Histone H1.3,P43277,,MSETAPAAPAAPAPVEKTPVKKKAKKTGAAAGKRKASGPPVSELITKAVAASKERSGVSLAALKKALAAAGYDVEKNNSRIKLGLKSLVSKGTLVQTKGTGASGSFKLNKKAASGEAKPKAKKAGAAKAKKPAGAAKKPKKATGAATPKKTAKKTPKKAKKPAAAAGAKKVSKSPKKVKAAKPKKAAKSPAKAKAPKAKASKPKASKPKATKAKKAAPRKK,1,220,220,SETAPAAPAAPAPVEKTPVKKKAKKTGAAAGKRKASGPPVSELITKAVAASKERSGVSLAALKKALAAAGYDVEKNNSRIKLGLKSLVSKGTLVQTKGTGASGSFKLNKKAASGEAKPKAKKAGAAKAKKPAGAAKKPKKATGAATPKKTAKKTPKKAKKPAAAAGAKKVSKSPKKVKAAKPKKAAKSPAKAKAPKAKASKPKASKPKATKAKKAAPRKK,22115.01746669,22128.29108,,RESID:38@2|RESID:38@16,,,1
10434,H13_MOUSE,P43277,Histone H1.3,P43277,,MSETAPAAPAAPAPVEKTPVKKKAKKTGAAAGKRKASGPPVSELITKAVAASKERSGVSLAALKKALAAAGYDVEKNNSRIKLGLKSLVSKGTLVQTKGTGASGSFKLNKKAASGEAKPKAKKAGAAKAKKPAGAAKKPKKATGAATPKKTAKKTPKKAKKPAAAAGAKKVSKSPKKVKAAKPKKAAKSPAKAKAPKAKASKPKASKPKATKAKKAAPRKK,0,220,221,MSETAPAAPAAPAPVEKTPVKKKAKKTGAAAGKRKASGPPVSELITKAVAASKERSGVSLAALKKALAAAGYDVEKNNSRIKLGLKSLVSKGTLVQTKGTGASGSFKLNKKAASGEAKPKAKKAGAAKAKKPAGAAKKPKKATGAATPKKTAKKTPKKAKKPAAAAGAKKVSKSPKKVKAAKPKKAAKSPAKAKAPKAKASKPKASKPKATKAKKAAPRKK,22086.12529469,22099.52368,,,,,1
