PFR,UniProt Id,Entry Accession,Entry Description,Isoform Accession,Isoform Description,Isoform Sequence,Start,End,Length,Proteoform Sequence,Monoisotopic Mass,Average Mass,Sequence Modifications,PTMs,N-Terminal,C-Terminal,Star
1342,RANG_HUMAN,P43487,Ran-specific GTPase-activating protein,P43487-1,1,MAAAKDTHEDHDTSTENTDESNHDPQFEPIVSLPEQEIKTLEEDEEELFKMRAKLFRFASENDLPEWKERGTGDVKLLKHKEKGAIRLLMRRDKTLKICANHYITPMMELKPNAGSDRAWVWNTHADFADECPKPELLAIRFLNAENAQKFKTKFEECRKEIEEREKKAGSGKNDHAEKVAEKLEALSVKEETKEDAEEKQ,1,200,200,AAAKDTHEDHDTSTENTDESNHDPQFEPIVSLPEQEIKTLEEDEEELFKMRAKLFRFASENDLPEWKERGTGDVKLLKHKEKGAIRLLMRRDKTLKICANHYITPMMELKPNAGSDRAWVWNTHADFADECPKPELLAIRFLNAENAQKFKTKFEECRKEIEEREKKAGSGKNDHAEKVAEKLEALSVKEETKEDAEEKQ,23206.54003969,23220.96948,,RESID:41@0,,,1
1356,RANG_HUMAN,P43487,Ran-specific GTPase-activating protein,P43487-1,1,MAAAKDTHEDHDTSTENTDESNHDPQFEPIVSLPEQEIKTLEEDEEELFKMRAKLFRFASENDLPEWKERGTGDVKLLKHKEKGAIRLLMRRDKTLKICANHYITPMMELKPNAGSDRAWVWNTHADFADECPKPELLAIRFLNAENAQKFKTKFEECRKEIEEREKKAGSGKNDHAEKVAEKLEALSVKEETKEDAEEKQ,1,200,200,AAAKDTHEDHDTSTENTDESNHDPQFEPIVSLPEQEIKTLEEDEEELFKMRAKLFRFASENDLPEWKERGTGDVKLLKHKEKGAIRLLMRRDKTLKICANHYITPMMELKPNAGSDRAWVWNTHADFADECPKPELLAIRFLNAENAQKFKTKFEECRKEIEEREKKAGSGKNDHAEKVAEKLEALSVKEETKEDAEEKQ,23286.50637069,23300.94948,,RESID:41@0|RESID:37@58,,,1
1651,RANG_HUMAN,P43487,Ran-specific GTPase-activating protein,P43487-1,1,MAAAKDTHEDHDTSTENTDESNHDPQFEPIVSLPEQEIKTLEEDEEELFKMRAKLFRFASENDLPEWKERGTGDVKLLKHKEKGAIRLLMRRDKTLKICANHYITPMMELKPNAGSDRAWVWNTHADFADECPKPELLAIRFLNAENAQKFKTKFEECRKEIEEREKKAGSGKNDHAEKVAEKLEALSVKEETKEDAEEKQ,1,200,200,AAAKDTHEDHDTSTENTDESNHDPQFEPIVSLPEQEIKTLEEDEEELFKMRAKLFRFASENDLPEWKERGTGDVKLLKHKEKGAIRLLMRRDKTLKICANHYITPMMELKPNAGSDRAWVWNTHADFADECPKPELLAIRFLNAENAQKFKTKFEECRKEIEEREKKAGSGKNDHAEKVAEKLEALSVKEETKEDAEEKQ,23248.55060469,23263.00948,,RESID:41@0|RESID:55@148,,,1
1756,RANG_HUMAN,P43487,Ran-specific GTPase-activating protein,P43487-1,1,MAAAKDTHEDHDTSTENTDESNHDPQFEPIVSLPEQEIKTLEEDEEELFKMRAKLFRFASENDLPEWKERGTGDVKLLKHKEKGAIRLLMRRDKTLKICANHYITPMMELKPNAGSDRAWVWNTHADFADECPKPELLAIRFLNAENAQKFKTKFEECRKEIEEREKKAGSGKNDHAEKVAEKLEALSVKEETKEDAEEKQ,1,200,200,AAAKDTHEDHDTSTENTDESNHDPQFEPIVSLPEQEIKTLEEDEEELFKMRAKLFRFASENDLPEWKERGTGDVKLLKHKEKGAIRLLMRRDKTLKICANHYITPMMELKPNAGSDRAWVWNTHADFADECPKPELLAIRFLNAENAQKFKTKFEECRKEIEEREKKAGSGKNDHAEKVAEKLEALSVKEETKEDAEEKQ,23370.52750069,23385.02948,,RESID:41@0|RESID:37@58|RESID:55@148|RESID:55@181,,,1
1890,RANG_HUMAN,P43487,Ran-specific GTPase-activating protein,P43487-1,1,MAAAKDTHEDHDTSTENTDESNHDPQFEPIVSLPEQEIKTLEEDEEELFKMRAKLFRFASENDLPEWKERGTGDVKLLKHKEKGAIRLLMRRDKTLKICANHYITPMMELKPNAGSDRAWVWNTHADFADECPKPELLAIRFLNAENAQKFKTKFEECRKEIEEREKKAGSGKNDHAEKVAEKLEALSVKEETKEDAEEKQ,1,200,200,AAAKDTHEDHDTSTENTDESNHDPQFEPIVSLPEQEIKTLEEDEEELFKMRAKLFRFASENDLPEWKERGTGDVKLLKHKEKGAIRLLMRRDKTLKICANHYITPMMELKPNAGSDRAWVWNTHADFADECPKPELLAIRFLNAENAQKFKTKFEECRKEIEEREKKAGSGKNDHAEKVAEKLEALSVKEETKEDAEEKQ,23290.56116969,23305.04948,,RESID:41@0|RESID:55@148|RESID:55@181,,,1
2038,RANG_HUMAN,P43487,Ran-specific GTPase-activating protein,P43487-1,1,MAAAKDTHEDHDTSTENTDESNHDPQFEPIVSLPEQEIKTLEEDEEELFKMRAKLFRFASENDLPEWKERGTGDVKLLKHKEKGAIRLLMRRDKTLKICANHYITPMMELKPNAGSDRAWVWNTHADFADECPKPELLAIRFLNAENAQKFKTKFEECRKEIEEREKKAGSGKNDHAEKVAEKLEALSVKEETKEDAEEKQ,1,200,200,AAAKDTHEDHDTSTENTDESNHDPQFEPIVSLPEQEIKTLEEDEEELFKMRAKLFRFASENDLPEWKERGTGDVKLLKHKEKGAIRLLMRRDKTLKICANHYITPMMELKPNAGSDRAWVWNTHADFADECPKPELLAIRFLNAENAQKFKTKFEECRKEIEEREKKAGSGKNDHAEKVAEKLEALSVKEETKEDAEEKQ,23328.51693569,23342.98948,,RESID:41@0|RESID:37@58|RESID:55@181,,,1
2126,RANG_HUMAN,P43487,Ran-specific GTPase-activating protein,P43487-1,1,MAAAKDTHEDHDTSTENTDESNHDPQFEPIVSLPEQEIKTLEEDEEELFKMRAKLFRFASENDLPEWKERGTGDVKLLKHKEKGAIRLLMRRDKTLKICANHYITPMMELKPNAGSDRAWVWNTHADFADECPKPELLAIRFLNAENAQKFKTKFEECRKEIEEREKKAGSGKNDHAEKVAEKLEALSVKEETKEDAEEKQ,1,200,200,AAAKDTHEDHDTSTENTDESNHDPQFEPIVSLPEQEIKTLEEDEEELFKMRAKLFRFASENDLPEWKERGTGDVKLLKHKEKGAIRLLMRRDKTLKICANHYITPMMELKPNAGSDRAWVWNTHADFADECPKPELLAIRFLNAENAQKFKTKFEECRKEIEEREKKAGSGKNDHAEKVAEKLEALSVKEETKEDAEEKQ,23328.51693569,23342.98948,,RESID:41@0|RESID:37@58|RESID:55@148,,,1
2137,RANG_HUMAN,P43487,Ran-specific GTPase-activating protein,P43487-1,1,MAAAKDTHEDHDTSTENTDESNHDPQFEPIVSLPEQEIKTLEEDEEELFKMRAKLFRFASENDLPEWKERGTGDVKLLKHKEKGAIRLLMRRDKTLKICANHYITPMMELKPNAGSDRAWVWNTHADFADECPKPELLAIRFLNAENAQKFKTKFEECRKEIEEREKKAGSGKNDHAEKVAEKLEALSVKEETKEDAEEKQ,1,200,200,AAAKDTHEDHDTSTENTDESNHDPQFEPIVSLPEQEIKTLEEDEEELFKMRAKLFRFASENDLPEWKERGTGDVKLLKHKEKGAIRLLMRRDKTLKICANHYITPMMELKPNAGSDRAWVWNTHADFADECPKPELLAIRFLNAENAQKFKTKFEECRKEIEEREKKAGSGKNDHAEKVAEKLEALSVKEETKEDAEEKQ,23248.55060469,23263.00948,,RESID:41@0|RESID:55@181,,,1
13785,RANG_HUMAN,P43487,Ran-specific GTPase-activating protein,P43487-1,1,MAAAKDTHEDHDTSTENTDESNHDPQFEPIVSLPEQEIKTLEEDEEELFKMRAKLFRFASENDLPEWKERGTGDVKLLKHKEKGAIRLLMRRDKTLKICANHYITPMMELKPNAGSDRAWVWNTHADFADECPKPELLAIRFLNAENAQKFKTKFEECRKEIEEREKKAGSGKNDHAEKVAEKLEALSVKEETKEDAEEKQ,1,200,200,AAAKDTHEDHDTSTENTDESNHDPQFEPIVSLPEQEIKTLEEDEEELFKMRAKLFRFASENDLPEWKERGTGDVKLLKHKEKGAIRLLMRRDKTLKICANHYITPMMELKPNAGSDRAWVWNTHADFADECPKPELLAIRFLNAENAQKFKTKFEECRKEIEEREKKAGSGKNDHAEKVAEKLEALSVKEETKEDAEEKQ,23164.52947469,23178.92948,,,,,1
14303,RANG_HUMAN,P43487,Ran-specific GTPase-activating protein,P43487-1,1,MAAAKDTHEDHDTSTENTDESNHDPQFEPIVSLPEQEIKTLEEDEEELFKMRAKLFRFASENDLPEWKERGTGDVKLLKHKEKGAIRLLMRRDKTLKICANHYITPMMELKPNAGSDRAWVWNTHADFADECPKPELLAIRFLNAENAQKFKTKFEECRKEIEEREKKAGSGKNDHAEKVAEKLEALSVKEETKEDAEEKQ,1,200,200,AAAKDTHEDHDTSTENTDESNHDPQFEPIVSLPEQEIKTLEEDEEELFKMRAKLFRFASENDLPEWKERGTGDVKLLKHKEKGAIRLLMRRDKTLKICANHYITPMMELKPNAGSDRAWVWNTHADFADECPKPELLAIRFLNVENAQKFKTKFEECRKEIEEREKKAGSGKNDHAEKVAEKLEALSVKEETKEDAEEKQ,23356.54823569,23371.04328,PSI-MOD:29@144,RESID:41@0|RESID:37@58|RESID:55@148,,,1
