PFR,UniProt Id,Entry Accession,Entry Description,Isoform Accession,Isoform Description,Isoform Sequence,Start,End,Length,Proteoform Sequence,Monoisotopic Mass,Average Mass,Sequence Modifications,PTMs,N-Terminal,C-Terminal,Star
1114,PSB3_HUMAN,P49720,Proteasome subunit beta type-3,P49720,,MSIMSYNGGAVMAMKGKNCVAIAADRRFGIQAQMVTTDFQKIFPMGDRLYIGLAGLATDVQTVAQRLKFRLNLYELKEGRQIKPYTLMSMVANLLYEKRFGPYYTEPVIAGLDPKTFKPFICSLDLIGCPMVTDDFVVSGTCAEQMYGMCESLWEPNMDPDHLFETISQAMLNAVDRDAVSGMGVIVHIIEKDKITTRTLKARMD,1,204,204,SIMSYNGGAVMAMKGKNCVAIAADRRFGIQAQMVTTDFQKIFPMGDRLYIGLAGLATDVQTVAQRLKFRLNLYELKEGRQIKPYTLMSMVANLLYEKRFGPYYTEPVIAGLDPKTFKPFICSLDLIGCPMVTDDFVVSGTCAEQMYGMCESLWEPNMDPDHLFETISQAMLNAVDRDAVSGMGVIVHIIEKDKITTRTLKARMD,22802.41032469,22817.69028,,,,,1
1135,PSB3_HUMAN,P49720,Proteasome subunit beta type-3,P49720,,MSIMSYNGGAVMAMKGKNCVAIAADRRFGIQAQMVTTDFQKIFPMGDRLYIGLAGLATDVQTVAQRLKFRLNLYELKEGRQIKPYTLMSMVANLLYEKRFGPYYTEPVIAGLDPKTFKPFICSLDLIGCPMVTDDFVVSGTCAEQMYGMCESLWEPNMDPDHLFETISQAMLNAVDRDAVSGMGVIVHIIEKDKITTRTLKARMD,0,204,205,MSIMSYNGGAVMAMKGKNCVAIAADRRFGIQAQMVTTDFQKIFPMGDRLYIGLAGLATDVQTVAQRLKFRLNLYELKEGRQIKPYTLMSMVANLLYEKRFGPYYTEPVIAGLDPKTFKPFICSLDLIGCPMVTDDFVVSGTCAEQMYGMCESLWEPNMDPDHLFETISQAMLNAVDRDAVSGMGVIVHIIEKDKITTRTLKARMD,22975.46137969,22990.92288,,RESID:49@0,,,1
1175,PSB3_HUMAN,P49720,Proteasome subunit beta type-3,P49720,,MSIMSYNGGAVMAMKGKNCVAIAADRRFGIQAQMVTTDFQKIFPMGDRLYIGLAGLATDVQTVAQRLKFRLNLYELKEGRQIKPYTLMSMVANLLYEKRFGPYYTEPVIAGLDPKTFKPFICSLDLIGCPMVTDDFVVSGTCAEQMYGMCESLWEPNMDPDHLFETISQAMLNAVDRDAVSGMGVIVHIIEKDKITTRTLKARMD,0,204,205,MSIMSYNGGAVMAMKGKNCVAIAADRRFGIQAQMVTTDFQKIFPMGDRLYIGLAGLATDVQTVAQRLKFRLNLYELKEGRQIKPYTLMSMVANLLYEKRFGPYYTEPVIAGLDPKTFKPFICSLDLIGCPMVTDDFVVSGTCAEQMYGMCESLWEPNMDPDHLFETISQAMLNAVDRDAVSGMGVIVHIIEKDKITTRTLKARMD,23017.47194469,23032.96288,,RESID:49@0|RESID:55@76,,,1
1176,PSB3_HUMAN,P49720,Proteasome subunit beta type-3,P49720,,MSIMSYNGGAVMAMKGKNCVAIAADRRFGIQAQMVTTDFQKIFPMGDRLYIGLAGLATDVQTVAQRLKFRLNLYELKEGRQIKPYTLMSMVANLLYEKRFGPYYTEPVIAGLDPKTFKPFICSLDLIGCPMVTDDFVVSGTCAEQMYGMCESLWEPNMDPDHLFETISQAMLNAVDRDAVSGMGVIVHIIEKDKITTRTLKARMD,0,204,205,MSIMSYNGGAVMAMKGKNCVAIAADRRFGIQAQMVTTDFQKIFPMGDRLYIGLAGLATDVQTVAQRLKFRLNLYELKEGRQIKPYTLMSMVANLLYEKRFGPYYTEPVIAGLDPKTFKPFICSLDLIGCPMVTDDFVVSGTCAEQMYGMCESLWEPNMDPDHLFETISQAMLNAVDRDAVSGMGVIVHIIEKDKITTRTLKARMD,23059.48250969,23075.00288,,RESID:49@0|RESID:51@1|RESID:55@76,,,1
1213,PSB3_HUMAN,P49720,Proteasome subunit beta type-3,P49720,,MSIMSYNGGAVMAMKGKNCVAIAADRRFGIQAQMVTTDFQKIFPMGDRLYIGLAGLATDVQTVAQRLKFRLNLYELKEGRQIKPYTLMSMVANLLYEKRFGPYYTEPVIAGLDPKTFKPFICSLDLIGCPMVTDDFVVSGTCAEQMYGMCESLWEPNMDPDHLFETISQAMLNAVDRDAVSGMGVIVHIIEKDKITTRTLKARMD,1,204,204,SIMSYNGGAVMAMKGKNCVAIAADRRFGIQAQMVTTDFQKIFPMGDRLYIGLAGLATDVQTVAQRLKFRLNLYELKEGRQIKPYTLMSMVANLLYEKRFGPYYTEPVIAGLDPKTFKPFICSLDLIGCPMVTDDFVVSGTCAEQMYGMCESLWEPNMDPDHLFETISQAMLNAVDRDAVSGMGVIVHIIEKDKITTRTLKARMD,22844.42088969,22859.73028,,RESID:51@0,,,1
1239,PSB3_HUMAN,P49720,Proteasome subunit beta type-3,P49720,,MSIMSYNGGAVMAMKGKNCVAIAADRRFGIQAQMVTTDFQKIFPMGDRLYIGLAGLATDVQTVAQRLKFRLNLYELKEGRQIKPYTLMSMVANLLYEKRFGPYYTEPVIAGLDPKTFKPFICSLDLIGCPMVTDDFVVSGTCAEQMYGMCESLWEPNMDPDHLFETISQAMLNAVDRDAVSGMGVIVHIIEKDKITTRTLKARMD,0,204,205,MSIMSYNGGAVMAMKGKNCVAIAADRRFGIQAQMVTTDFQKIFPMGDRLYIGLAGLATDVQTVAQRLKFRLNLYELKEGRQIKPYTLMSMVANLLYEKRFGPYYTEPVIAGLDPKTFKPFICSLDLIGCPMVTDDFVVSGTCAEQMYGMCESLWEPNMDPDHLFETISQAMLNAVDRDAVSGMGVIVHIIEKDKITTRTLKARMD,22933.45081469,22948.88288,,,,,1
1240,PSB3_HUMAN,P49720,Proteasome subunit beta type-3,P49720,,MSIMSYNGGAVMAMKGKNCVAIAADRRFGIQAQMVTTDFQKIFPMGDRLYIGLAGLATDVQTVAQRLKFRLNLYELKEGRQIKPYTLMSMVANLLYEKRFGPYYTEPVIAGLDPKTFKPFICSLDLIGCPMVTDDFVVSGTCAEQMYGMCESLWEPNMDPDHLFETISQAMLNAVDRDAVSGMGVIVHIIEKDKITTRTLKARMD,0,204,205,MSIMSYNGGAVMAMKGKNCVAIAADRRFGIQAQMVTTDFQKIFPMGDRLYIGLAGLATDVQTVAQRLKFRLNLYELKEGRQIKPYTLMSMVANLLYEKRFGPYYTEPVIAGLDPKTFKPFICSLDLIGCPMVTDDFVVSGTCAEQMYGMCESLWEPNMDPDHLFETISQAMLNAVDRDAVSGMGVIVHIIEKDKITTRTLKARMD,22975.46137969,22990.92288,,RESID:55@76,,,1
1594,PSB3_HUMAN,P49720,Proteasome subunit beta type-3,P49720,,MSIMSYNGGAVMAMKGKNCVAIAADRRFGIQAQMVTTDFQKIFPMGDRLYIGLAGLATDVQTVAQRLKFRLNLYELKEGRQIKPYTLMSMVANLLYEKRFGPYYTEPVIAGLDPKTFKPFICSLDLIGCPMVTDDFVVSGTCAEQMYGMCESLWEPNMDPDHLFETISQAMLNAVDRDAVSGMGVIVHIIEKDKITTRTLKARMD,1,204,204,SIMSYNGGAVMAMKGKNCVAIAADRRFGIQAQMVTTDFQKIFPMGDRLYIGLAGLATDVQTVAQRLKFRLNLYELKEGRQIKPYTLMSMVANLLYEKRFGPYYTEPVIAGLDPKTFKPFICSLDLIGCPMVTDDFVVSGTCAEQMYGMCESLWEPNMDPDHLFETISQAMLNAVDRDAVSGMGVIVHIIEKDKITTRTLKARMD,22886.43145469,22901.77028,,RESID:51@0|RESID:55@75,,,1
2215,PSB3_HUMAN,P49720,Proteasome subunit beta type-3,P49720,,MSIMSYNGGAVMAMKGKNCVAIAADRRFGIQAQMVTTDFQKIFPMGDRLYIGLAGLATDVQTVAQRLKFRLNLYELKEGRQIKPYTLMSMVANLLYEKRFGPYYTEPVIAGLDPKTFKPFICSLDLIGCPMVTDDFVVSGTCAEQMYGMCESLWEPNMDPDHLFETISQAMLNAVDRDAVSGMGVIVHIIEKDKITTRTLKARMD,1,204,204,SIMSYNGGAVMAMKGKNCVAIAADRRFGIQAQMVTTDFQKIFPMGDRLYIGLAGLATDVQTVAQRLKFRLNLYELKEGRQIKPYTLMSMVANLLYEKRFGPYYTEPVIAGLDPKTFKPFICSLDLIGCPMVTDDFVVSGTCAEQMYGMCESLWEPNMDPDHLFETISQAMLNAVDRDAVSGMGVIVHIIEKDKITTRTLKARMD,22844.42088969,22859.73028,,RESID:55@75,,,1
13879,PSB3_HUMAN,P49720,Proteasome subunit beta type-3,P49720,,MSIMSYNGGAVMAMKGKNCVAIAADRRFGIQAQMVTTDFQKIFPMGDRLYIGLAGLATDVQTVAQRLKFRLNLYELKEGRQIKPYTLMSMVANLLYEKRFGPYYTEPVIAGLDPKTFKPFICSLDLIGCPMVTDDFVVSGTCAEQMYGMCESLWEPNMDPDHLFETISQAMLNAVDRDAVSGMGVIVHIIEKDKITTRTLKARMD,1,204,204,SIMSYNGGAVMAMKGKNCVAIAADRRFGIQAQLVTTDFQKIFPMGDRLYIGLAGLATDVQTVAQRLKFRLNLYELKEGRQIKPYTLMSMVANLLYEKRFGPYYTEPVIAGLDPKTFKPFICSLDLIGCPMVTDDFVVSGTCAEQMYGMCESLWEPNMDPDHLFETISQAMLNAVDRDAVSGMGVIVHIIEKDKITTRTLKARMD,22826.46445969,22841.69708,PSI-MOD:20@33,RESID:51@0,,,1
14275,PSB3_HUMAN,P49720,Proteasome subunit beta type-3,P49720,,MSIMSYNGGAVMAMKGKNCVAIAADRRFGIQAQMVTTDFQKIFPMGDRLYIGLAGLATDVQTVAQRLKFRLNLYELKEGRQIKPYTLMSMVANLLYEKRFGPYYTEPVIAGLDPKTFKPFICSLDLIGCPMVTDDFVVSGTCAEQMYGMCESLWEPNMDPDHLFETISQAMLNAVDRDAVSGMGVIVHIIEKDKITTRTLKARMD,1,204,204,SIMSYNGGAVMAMKGKNCVAIAADRRFGIQAQLVTTDFQKIFPMGDRLYIGLAGLATDVQTVAQRLKFRLNLYELKEGRQIKPYTLMSMVANLLYEKRFGPYYTEPVIAGLDPKTFKPFICSLDLIGCPMVTDDFVVSGTCAEQMYGMCESLWEPNMDPDHLFETISQAMLNAVDRDAVSGMGVIVHIIEKDKITTRTLKARMD,22784.45389469,22799.65708,PSI-MOD:20@33,,,,1
14276,PSB3_HUMAN,P49720,Proteasome subunit beta type-3,P49720,,MSIMSYNGGAVMAMKGKNCVAIAADRRFGIQAQMVTTDFQKIFPMGDRLYIGLAGLATDVQTVAQRLKFRLNLYELKEGRQIKPYTLMSMVANLLYEKRFGPYYTEPVIAGLDPKTFKPFICSLDLIGCPMVTDDFVVSGTCAEQMYGMCESLWEPNMDPDHLFETISQAMLNAVDRDAVSGMGVIVHIIEKDKITTRTLKARMD,1,204,204,SIMSYNGGAVMAMKGKNCVAIAADRRFGIQAQLVTTDFQKIFPMGDRLYIGLAGLATDVQTVAQRLKFRLNLYELKEGRQIKPYTLMSMVANLLYEKRFGPYYTEPVIAGLDPKTFKPFICSLDLIGCPMVTDDFVVSGTCAEQMYGMCESLWEPNMDPDHLFETISQAMLNAVDRDAVSGMGVIVHIIEKDKITTRTLKARMD,22826.46445969,22841.69708,PSI-MOD:20@33,RESID:55@75,,,1
14284,PSB3_HUMAN,P49720,Proteasome subunit beta type-3,P49720,,MSIMSYNGGAVMAMKGKNCVAIAADRRFGIQAQMVTTDFQKIFPMGDRLYIGLAGLATDVQTVAQRLKFRLNLYELKEGRQIKPYTLMSMVANLLYEKRFGPYYTEPVIAGLDPKTFKPFICSLDLIGCPMVTDDFVVSGTCAEQMYGMCESLWEPNMDPDHLFETISQAMLNAVDRDAVSGMGVIVHIIEKDKITTRTLKARMD,0,204,205,MSIMSYNGGAVMAMKGKNCVAIAADRRFGIQAQLVTTDFQKIFPMGDRLYIGLAGLATDVQTVAQRLKFRLNLYELKEGRQIKPYTLMSMVANLLYEKRFGPYYTEPVIAGLDPKTFKPFICSLDLIGCPMVTDDFVVSGTCAEQMYGMCESLWEPNMDPDHLFETISQAMLNAVDRDAVSGMGVIVHIIEKDKITTRTLKARMD,22915.49438469,22930.84968,PSI-MOD:20@33,,,,1
14286,PSB3_HUMAN,P49720,Proteasome subunit beta type-3,P49720,,MSIMSYNGGAVMAMKGKNCVAIAADRRFGIQAQMVTTDFQKIFPMGDRLYIGLAGLATDVQTVAQRLKFRLNLYELKEGRQIKPYTLMSMVANLLYEKRFGPYYTEPVIAGLDPKTFKPFICSLDLIGCPMVTDDFVVSGTCAEQMYGMCESLWEPNMDPDHLFETISQAMLNAVDRDAVSGMGVIVHIIEKDKITTRTLKARMD,0,204,205,MSIMSYNGGAVMAMKGKNCVAIAADRRFGIQAQLVTTDFQKIFPMGDRLYIGLAGLATDVQTVAQRLKFRLNLYELKEGRQIKPYTLMSMVANLLYEKRFGPYYTEPVIAGLDPKTFKPFICSLDLIGCPMVTDDFVVSGTCAEQMYGMCESLWEPNMDPDHLFETISQAMLNAVDRDAVSGMGVIVHIIEKDKITTRTLKARMD,22957.50494969,22972.88968,PSI-MOD:20@33,RESID:55@76,,,1
