PFR,UniProt Id,Entry Accession,Entry Description,Isoform Accession,Isoform Description,Isoform Sequence,Start,End,Length,Proteoform Sequence,Monoisotopic Mass,Average Mass,Sequence Modifications,PTMs,N-Terminal,C-Terminal,Star
10810,SC6B1_YEAST,P52870,Protein transport protein SBH1,P52870,,MSSPTPPGGQRTLQKRKQGSSQKVAASAPKKNTNSNNSILKIYSDEATGLRVDPLVVLFLAVGFIFSVVALHVISKVAGKLF,0,81,82,MSSPTPPGGQRTLQKRKQGSSQKVAASAPKKNTNSNNSILKIYSDEATGLRVDPLVVLFLAVGFIFSVVALHVISKVAGKLF,8747.81077969,8753.21248,,PSI-MOD:394@0,,,1
10897,SC6B1_YEAST,P52870,Protein transport protein SBH1,P52870,,MSSPTPPGGQRTLQKRKQGSSQKVAASAPKKNTNSNNSILKIYSDEATGLRVDPLVVLFLAVGFIFSVVALHVISKVAGKLF,1,81,81,SSPTPPGGQRTLQKRKQGSSQKVAASAPKKNTNSNNSILKIYSDEATGLRVDPLVVLFLAVGFIFSVVALHVISKVAGKLF,8616.77028969,8622.01988,,PSI-MOD:394@0,,,1
11237,SC6B1_YEAST,P52870,Protein transport protein SBH1,P52870,,MSSPTPPGGQRTLQKRKQGSSQKVAASAPKKNTNSNNSILKIYSDEATGLRVDPLVVLFLAVGFIFSVVALHVISKVAGKLF,16,80,65,KQGSSQKVAASAPKKNTNSNNSILKIYSDEATGLRVDPLVVLFLAVGFIFSVVALHVISKVAGKL,6836.83229469,6841.01288,,,,,1
11238,SC6B1_YEAST,P52870,Protein transport protein SBH1,P52870,,MSSPTPPGGQRTLQKRKQGSSQKVAASAPKKNTNSNNSILKIYSDEATGLRVDPLVVLFLAVGFIFSVVALHVISKVAGKLF,16,81,66,KQGSSQKVAASAPKKNTNSNNSILKIYSDEATGLRVDPLVVLFLAVGFIFSVVALHVISKVAGKLF,6983.90070469,6988.18948,,,,,1
11397,SC6B1_YEAST,P52870,Protein transport protein SBH1,P52870,,MSSPTPPGGQRTLQKRKQGSSQKVAASAPKKNTNSNNSILKIYSDEATGLRVDPLVVLFLAVGFIFSVVALHVISKVAGKLF,0,81,82,MSSPTPPGGQRTLQKRKQGSSQKVAASAPKKNTNSNNSILKIYSDEATGLRVDPLVVLFLAVGFIFSVVALHVISKVAGKLF,8705.80021469,8711.17248,,,,,1
11508,SC6B1_YEAST,P52870,Protein transport protein SBH1,P52870,,MSSPTPPGGQRTLQKRKQGSSQKVAASAPKKNTNSNNSILKIYSDEATGLRVDPLVVLFLAVGFIFSVVALHVISKVAGKLF,17,81,65,QGSSQKVAASAPKKNTNSNNSILKIYSDEATGLRVDPLVVLFLAVGFIFSVVALHVISKVAGKLF,6855.80574469,6860.01538,,,,,1
11603,SC6B1_YEAST,P52870,Protein transport protein SBH1,P52870,,MSSPTPPGGQRTLQKRKQGSSQKVAASAPKKNTNSNNSILKIYSDEATGLRVDPLVVLFLAVGFIFSVVALHVISKVAGKLF,1,81,81,SSPTPPGGQRTLQKRKQGSSQKVAASAPKKNTNSNNSILKIYSDEATGLRVDPLVVLFLAVGFIFSVVALHVISKVAGKLF,8574.75972469,8579.97988,,,,,1
11660,SC6B1_YEAST,P52870,Protein transport protein SBH1,P52870,,MSSPTPPGGQRTLQKRKQGSSQKVAASAPKKNTNSNNSILKIYSDEATGLRVDPLVVLFLAVGFIFSVVALHVISKVAGKLF,4,81,78,TPPGGQRTLQKRKQGSSQKVAASAPKKNTNSNNSILKIYSDEATGLRVDPLVVLFLAVGFIFSVVALHVISKVAGKLF,8303.64290469,8308.70678,,,,,1
