PFR,UniProt Id,Entry Accession,Entry Description,Isoform Accession,Isoform Description,Isoform Sequence,Start,End,Length,Proteoform Sequence,Monoisotopic Mass,Average Mass,Sequence Modifications,PTMs,N-Terminal,C-Terminal,Star
10684,SC6B2_YEAST,P52871,Protein transport protein SBH2,P52871,,MAASVPPGGQRILQKRRQAQSIKEKQAKQTPTSTRQAGYGGSSSSILKLYTDEANGFRVDSLVVLFLSVGFIFSVIALHLLTKFTHII,1,87,87,AASVPPGGQRILQKRRQAQSIKEKQAKQTPTSTRQAGYGGSSSSILKLYTDEANGFRVDSLVVLFLSVGFIFSVIALHLLTKFTHII,9511.20508968999,9517.00508000001,,PSI-MOD:394@0,,,1
10731,SC6B2_YEAST,P52871,Protein transport protein SBH2,P52871,,MAASVPPGGQRILQKRRQAQSIKEKQAKQTPTSTRQAGYGGSSSSILKLYTDEANGFRVDSLVVLFLSVGFIFSVIALHLLTKFTHII,0,87,88,MAASVPPGGQRILQKRRQAQSIKEKQAKQTPTSTRQAGYGGSSSSILKLYTDEANGFRVDSLVVLFLSVGFIFSVIALHLLTKFTHII,9642.24557969,9648.19768000001,,PSI-MOD:394@0,,,1
10943,SC6B2_YEAST,P52871,Protein transport protein SBH2,P52871,,MAASVPPGGQRILQKRRQAQSIKEKQAKQTPTSTRQAGYGGSSSSILKLYTDEANGFRVDSLVVLFLSVGFIFSVIALHLLTKFTHII,1,86,86,AASVPPGGQRILQKRRQAQSIKEKQAKQTPTSTRQAGYGGSSSSILKLYTDEANGFRVDSLVVLFLSVGFIFSVIALHLLTKFTHI,9356.11046469,9361.80568000001,,,,,1
10944,SC6B2_YEAST,P52871,Protein transport protein SBH2,P52871,,MAASVPPGGQRILQKRRQAQSIKEKQAKQTPTSTRQAGYGGSSSSILKLYTDEANGFRVDSLVVLFLSVGFIFSVIALHLLTKFTHII,1,87,87,AASVPPGGQRILQKRRQAQSIKEKQAKQTPTSTRQAGYGGSSSSILKLYTDEANGFRVDSLVVLFLSVGFIFSVIALHLLTKFTHII,9469.19452469,9474.96508000001,,,,,1
11030,SC6B2_YEAST,P52871,Protein transport protein SBH2,P52871,,MAASVPPGGQRILQKRRQAQSIKEKQAKQTPTSTRQAGYGGSSSSILKLYTDEANGFRVDSLVVLFLSVGFIFSVIALHLLTKFTHII,2,86,85,ASVPPGGQRILQKRRQAQSIKEKQAKQTPTSTRQAGYGGSSSSILKLYTDEANGFRVDSLVVLFLSVGFIFSVIALHLLTKFTHI,9285.07335469,9290.72688000001,,,,,1
11031,SC6B2_YEAST,P52871,Protein transport protein SBH2,P52871,,MAASVPPGGQRILQKRRQAQSIKEKQAKQTPTSTRQAGYGGSSSSILKLYTDEANGFRVDSLVVLFLSVGFIFSVIALHLLTKFTHII,2,87,86,ASVPPGGQRILQKRRQAQSIKEKQAKQTPTSTRQAGYGGSSSSILKLYTDEANGFRVDSLVVLFLSVGFIFSVIALHLLTKFTHII,9398.15741469,9403.88628000001,,,,,1
11284,SC6B2_YEAST,P52871,Protein transport protein SBH2,P52871,,MAASVPPGGQRILQKRRQAQSIKEKQAKQTPTSTRQAGYGGSSSSILKLYTDEANGFRVDSLVVLFLSVGFIFSVIALHLLTKFTHII,0,87,88,MAASVPPGGQRILQKRRQAQSIKEKQAKQTPTSTRQAGYGGSSSSILKLYTDEANGFRVDSLVVLFLSVGFIFSVIALHLLTKFTHII,9600.23501469,9606.15768000001,,,,,1
11529,SC6B2_YEAST,P52871,Protein transport protein SBH2,P52871,,MAASVPPGGQRILQKRRQAQSIKEKQAKQTPTSTRQAGYGGSSSSILKLYTDEANGFRVDSLVVLFLSVGFIFSVIALHLLTKFTHII,16,86,71,RQAQSIKEKQAKQTPTSTRQAGYGGSSSSILKLYTDEANGFRVDSLVVLFLSVGFIFSVIALHLLTKFTHI,7797.20490469,7801.97078,,,,,1
11531,SC6B2_YEAST,P52871,Protein transport protein SBH2,P52871,,MAASVPPGGQRILQKRRQAQSIKEKQAKQTPTSTRQAGYGGSSSSILKLYTDEANGFRVDSLVVLFLSVGFIFSVIALHLLTKFTHII,15,86,72,RRQAQSIKEKQAKQTPTSTRQAGYGGSSSSILKLYTDEANGFRVDSLVVLFLSVGFIFSVIALHLLTKFTHI,7953.30601469,7958.15828,,,,,1
11532,SC6B2_YEAST,P52871,Protein transport protein SBH2,P52871,,MAASVPPGGQRILQKRRQAQSIKEKQAKQTPTSTRQAGYGGSSSSILKLYTDEANGFRVDSLVVLFLSVGFIFSVIALHLLTKFTHII,15,87,73,RRQAQSIKEKQAKQTPTSTRQAGYGGSSSSILKLYTDEANGFRVDSLVVLFLSVGFIFSVIALHLLTKFTHII,8066.39007469,8071.31768,,,,,1
11619,SC6B2_YEAST,P52871,Protein transport protein SBH2,P52871,,MAASVPPGGQRILQKRRQAQSIKEKQAKQTPTSTRQAGYGGSSSSILKLYTDEANGFRVDSLVVLFLSVGFIFSVIALHLLTKFTHII,3,86,84,SVPPGGQRILQKRRQAQSIKEKQAKQTPTSTRQAGYGGSSSSILKLYTDEANGFRVDSLVVLFLSVGFIFSVIALHLLTKFTHI,9214.03624469,9219.64808000001,,,,,1
