PFR,UniProt Id,Entry Accession,Entry Description,Isoform Accession,Isoform Description,Isoform Sequence,Start,End,Length,Proteoform Sequence,Monoisotopic Mass,Average Mass,Sequence Modifications,PTMs,N-Terminal,C-Terminal,Star
1101,ATP5E_HUMAN,P56381,ATP synthase subunit epsilon; mitochondrial,P56381,,MVAYWRQAGLSYIRYSQICAKAVRDALKTEFKANAEKTSGSNVKIVKVKKE,1,50,50,VAYWRQAGLSYIRYSQICAKAVRDALKTEFKANAEKTSGSNVKIVKVKKE,5645.06672469,5648.56968,,,,,1
12391,ATP5E_HUMAN,P56381,ATP synthase subunit epsilon; mitochondrial,P56381,,MVAYWRQAGLSYIRYSQICAKAVRDALKTEFKANAEKTSGSNVKIVKVKKE,1,50,50,VAYWRQAGLSYIRYSQICAKAVRDALKTEFKANAEKTSGSNVKIVKVKKE,5687.07728969,5690.60968,,RESID:54@0,,,1
12428,ATP5E_HUMAN,P56381,ATP synthase subunit epsilon; mitochondrial,P56381,,MVAYWRQAGLSYIRYSQICAKAVRDALKTEFKANAEKTSGSNVKIVKVKKE,0,50,51,MVAYWRQAGLSYIRYSQICAKAVRDALKTEFKANAEKTSGSNVKIVKVKKE,5818.11777969,5821.80228,,RESID:49@0,,,1
12539,ATP5E_HUMAN,P56381,ATP synthase subunit epsilon; mitochondrial,P56381,,MVAYWRQAGLSYIRYSQICAKAVRDALKTEFKANAEKTSGSNVKIVKVKKE,0,50,51,MVAYWRQAGLSCIRYSQICAKAVRDALKTEFKANAEKTSGSNVKIVKVKKE,5758.06363969,5761.76508,PSI-MOD:14@11,RESID:49@0,,,1
12582,ATP5E_HUMAN,P56381,ATP synthase subunit epsilon; mitochondrial,P56381,,MVAYWRQAGLSYIRYSQICAKAVRDALKTEFKANAEKTSGSNVKIVKVKKE,0,50,51,MVAYWRQAGLSYIRYSQICAKAVRDALKTEFKANAEKTSGSNVKIVKVKKE,5776.10721469,5779.76228,,,,,1
12766,ATP5E_HUMAN,P56381,ATP synthase subunit epsilon; mitochondrial,P56381,,MVAYWRQAGLSYIRYSQICAKAVRDALKTEFKANAEKTSGSNVKIVKVKKE,1,50,50,VAYWRQAGLSCIRYSQICAKAVRDALKTEFKANAEKTSGSNVKIVKVKKE,5669.03371469,5672.61248,PSI-MOD:14@11,RESID:54@0|RESID:55@19,,,1
13274,ATP5E_HUMAN,P56381,ATP synthase subunit epsilon; mitochondrial,P56381,,MVAYWRQAGLSYIRYSQICAKAVRDALKTEFKANAEKTSGSNVKIVKVKKE,1,50,50,VAYWRQAGLSYIRYSQICAKAVRDALKTEFKANAEKTSGSNVKIVKVKKE,5687.07728969,5690.60968,,RESID:55@19,,,1
13328,ATP5E_HUMAN,P56381,ATP synthase subunit epsilon; mitochondrial,P56381,,MVAYWRQAGLSYIRYSQICAKAVRDALKTEFKANAEKTSGSNVKIVKVKKE,0,50,51,MVAYWRQAGLSCIRYSQICAKAVRDALKTEFKANAEKTSGSNVKIVKVKKE,5758.06363969,5761.76508,PSI-MOD:14@11,RESID:55@20,,,1
13405,ATP5E_HUMAN,P56381,ATP synthase subunit epsilon; mitochondrial,P56381,,MVAYWRQAGLSYIRYSQICAKAVRDALKTEFKANAEKTSGSNVKIVKVKKE,1,50,50,VAYWRQAGLSYIRYSQICAKAVRDALKTEFKANAEKTSGSNVKIVKVKKE,5729.08785469,5732.64968,,RESID:54@0|RESID:55@19,,,1
13446,ATP5E_HUMAN,P56381,ATP synthase subunit epsilon; mitochondrial,P56381,,MVAYWRQAGLSYIRYSQICAKAVRDALKTEFKANAEKTSGSNVKIVKVKKE,1,50,50,VAYWRQAGLSCIRYSQICAKAVRDALKTEFKANAEKTSGSNVKIVKVKKE,5627.02314969,5630.57248,PSI-MOD:14@11,RESID:55@19,,,1
13631,ATP5E_HUMAN,P56381,ATP synthase subunit epsilon; mitochondrial,P56381,,MVAYWRQAGLSYIRYSQICAKAVRDALKTEFKANAEKTSGSNVKIVKVKKE,1,50,50,VAYWRQAGLSCIRYSQICAKAVRDALKTEFKANAEKTSGSNVKIVKVKKE,5585.01258469,5588.53248,PSI-MOD:14@11,,,,1
16191,ATP5E_HUMAN,P56381,ATP synthase subunit epsilon; mitochondrial,P56381,,MVAYWRQAGLSYIRYSQICAKAVRDALKTEFKANAEKTSGSNVKIVKVKKE,1,50,50,VAYWRQAGLSYIRYSQICAKAVRDALKTEFKANAEKTSGSNVKIVKVKKE,5771.09842,5774.68968,,RESID:55@19|RESID:55@30,PSI-MOD:1458,,0
16367,ATP5E_HUMAN,P56381,ATP synthase subunit epsilon; mitochondrial,P56381,,MVAYWRQAGLSYIRYSQICAKAVRDALKTEFKANAEKTSGSNVKIVKVKKE,1,50,50,VAYWRQAGLSYIRYSQICAKAVRDALKTEFKANAEKTSGSNVKIVKVKKE,5845.098813,5848.70968,,RESID:545@19|RESID:545@30,,,0
16425,ATP5E_HUMAN,P56381,ATP synthase subunit epsilon; mitochondrial,P56381,,MVAYWRQAGLSYIRYSQICAKAVRDALKTEFKANAEKTSGSNVKIVKVKKE,4,50,47,WRQAGLSYIRYSQICAKAVRDALKTEFKANAEKTSGSNVKIVKVKKE,5311.897875,5315.18228,,,,,0
16464,ATP5E_HUMAN,P56381,ATP synthase subunit epsilon; mitochondrial,P56381,,MVAYWRQAGLSYIRYSQICAKAVRDALKTEFKANAEKTSGSNVKIVKVKKE,1,50,50,VAYWRQAGLSYIRYSQICAKAVRDALKTEFKANAEKTSGSNVKIVKVKKE,5745.082769,5748.63968,,RESID:545@19,,,0
16746,ATP5E_HUMAN,P56381,ATP synthase subunit epsilon; mitochondrial,P56381,,MVAYWRQAGLSYIRYSQICAKAVRDALKTEFKANAEKTSGSNVKIVKVKKE,1,50,50,VAYWRQAGLSCIRYSQICAKAVRDALKTEFKANAEKTSGSNVKIVKVKKE,5727.039194,5730.64248,PSI-MOD:14@11,RESID:545@19,PSI-MOD:1458,,0
17164,ATP5E_HUMAN,P56381,ATP synthase subunit epsilon; mitochondrial,P56381,,MVAYWRQAGLSYIRYSQICAKAVRDALKTEFKANAEKTSGSNVKIVKVKKE,1,50,50,VAYWRQAGLSCIRYSQICAKAVRDALKTEFKANAEKTSGSNVKIVKVKKE,5795.06541,5798.73248,PSI-MOD:14@11,RESID:55@19|RESID:55@30|RESID:55@35|RESID:55@42,PSI-MOD:1458,,0
