PFR,UniProt Id,Entry Accession,Entry Description,Isoform Accession,Isoform Description,Isoform Sequence,Start,End,Length,Proteoform Sequence,Monoisotopic Mass,Average Mass,Sequence Modifications,PTMs,N-Terminal,C-Terminal,Star
1265,SC61B_HUMAN,P60468,Protein transport protein Sec61 subunit beta,P60468,,MPGPTPSGTNVGSSGRSPSKAVAARAAGSTVRQRKNASCGTRSAGRTTSAGTGGMWRFYTEDSPGLKVGPVPVLVMSLLFIASVFMLHIWGKYTRS,1,95,95,PGPTPSGTNVGSSGRSPSKAVAARAAGSTVRQRKNASCGTRSAGRTTSAGTGGMWRFYTEDSPGLKVGPVPVLVMSLLFIASVFMLHIWGKYTRS,9837.05683469,9843.25988,,,,,3
1658,SC61B_HUMAN,P60468,Protein transport protein Sec61 subunit beta,P60468,,MPGPTPSGTNVGSSGRSPSKAVAARAAGSTVRQRKNASCGTRSAGRTTSAGTGGMWRFYTEDSPGLKVGPVPVLVMSLLFIASVFMLHIWGKYTRS,1,95,95,PGPTPSGTNVGSSGRSPSKAVAARAAGSTVRQRKNASCGTRSAGRTTSAGTGGMWRFYTEDSPGLKVGPVPVLVMSLLFIASVFMLHIWGKYTRS,9917.02316569,9923.23988,,RESID:37@11,,,1
2039,SC61B_HUMAN,P60468,Protein transport protein Sec61 subunit beta,P60468,,MPGPTPSGTNVGSSGRSPSKAVAARAAGSTVRQRKNASCGTRSAGRTTSAGTGGMWRFYTEDSPGLKVGPVPVLVMSLLFIASVFMLHIWGKYTRS,0,95,96,MPGPTPSGTNVGSSGRSPSKAVAARAAGSTVRQRKNASCGTRSAGRTTSAGTGGMWRFYTEDSPGLKVGPVPVLVMSLLFIASVFMLHIWGKYTRS,10128.02998669,10134.41248,,RESID:38@4|RESID:37@6,,,1
2658,SC61B_HUMAN,P60468,Protein transport protein Sec61 subunit beta,P60468,,MPGPTPSGTNVGSSGRSPSKAVAARAAGSTVRQRKNASCGTRSAGRTTSAGTGGMWRFYTEDSPGLKVGPVPVLVMSLLFIASVFMLHIWGKYTRS,0,95,96,MPGPTPSGTNVGSSGRSPSKAVAARAAGSTVRQRKNASCGTRSAGRTTSAGTGGMWRFYTEDSPGLKVGPVPVLVMSLLFIASVFMLHIWGKYTRS,10010.10788969,10016.49248,,RESID:49@0,,,1
2878,SC61B_HUMAN,P60468,Protein transport protein Sec61 subunit beta,P60468,,MPGPTPSGTNVGSSGRSPSKAVAARAAGSTVRQRKNASCGTRSAGRTTSAGTGGMWRFYTEDSPGLKVGPVPVLVMSLLFIASVFMLHIWGKYTRS,1,95,95,PGPTPSGTNVGSSGRSPSKAVAARAAGSTVRQRKNASCGTRSAGRTTSAGTGGMWRFYTEDSPGLKVGPVPVLVMSLLFIASVFMLHIWGKYTRS,9879.06739968999,9885.29988000001,,RESID:50@0,,,1
3452,SC61B_HUMAN,P60468,Protein transport protein Sec61 subunit beta,P60468,,MPGPTPSGTNVGSSGRSPSKAVAARAAGSTVRQRKNASCGTRSAGRTTSAGTGGMWRFYTEDSPGLKVGPVPVLVMSLLFIASVFMLHIWGKYTRS,0,95,96,MPGPTPSGTNVGSSGRSPSKAVAARAAGSTVRQRKNASCGTRSAGRTTSAGTGGMWRFYTEDSPGLKVGPVPVLVMSLLFIASVFMLHIWGKYTRS,10888.06820369,10894.74248,,RESID:49@0|RESID:38@4|RESID:37@6|RESID:37@12|RESID:37@13|RESID:37@16|RESID:37@18|RESID:37@28|RESID:38@29|RESID:60@38,,,1
4418,SC61B_HUMAN,P60468,Protein transport protein Sec61 subunit beta,P60468,,MPGPTPSGTNVGSSGRSPSKAVAARAAGSTVRQRKNASCGTRSAGRTTSAGTGGMWRFYTEDSPGLKVGPVPVLVMSLLFIASVFMLHIWGKYTRS,0,95,96,MPGPTPSGTNVGSSGRSPSKAVAARAAGSTVRQRKNASCGTRSAGRTTSAGTGGMWRFYTEDSPGLKVGPVPVLVMSLLFIASVFMLHIWGKYTRS,9968.09732469,9974.45248,,,,,1
7205,SC61B_HUMAN,P60468,Protein transport protein Sec61 subunit beta,P60468,,MPGPTPSGTNVGSSGRSPSKAVAARAAGSTVRQRKNASCGTRSAGRTTSAGTGGMWRFYTEDSPGLKVGPVPVLVMSLLFIASVFMLHIWGKYTRS,1,95,95,PGPTPSGTNVGSSGRSPSKAVAARAAGSTVRQRKNASCGTRSAGRTTSAGTGGMWRFYTEDSPGLKVGPVPVLVMSLLFIASVFMLHIWGKYTRS,9917.02316569,9923.23988,,RESID:38@3,,,1
7304,SC61B_HUMAN,P60468,Protein transport protein Sec61 subunit beta,P60468,,MPGPTPSGTNVGSSGRSPSKAVAARAAGSTVRQRKNASCGTRSAGRTTSAGTGGMWRFYTEDSPGLKVGPVPVLVMSLLFIASVFMLHIWGKYTRS,1,95,95,PGPTPSGTNVGSSGRSPSKAVAARAAGSTVRQRKNASCGTRSAGRTTSAGTGGMWRFYTEDSPGLKVGPVPVLVMSLLFIASVFMLHIWGKYTRS,10475.11815569,10481.56988,,RESID:38@3|RESID:37@12|RESID:37@15|RESID:37@17|RESID:37@27|RESID:60@37,,,1
7685,SC61B_HUMAN,P60468,Protein transport protein Sec61 subunit beta,P60468,,MPGPTPSGTNVGSSGRSPSKAVAARAAGSTVRQRKNASCGTRSAGRTTSAGTGGMWRFYTEDSPGLKVGPVPVLVMSLLFIASVFMLHIWGKYTRS,1,95,95,PGPTPSGTNVGSSGRSPSKAVAARAAGSTVRQRKNASCGTRSAGRTTSAGTGGMWRFYTEDSPGLKVGPVPVLVMSLLFIASVFMLHIWGKYTRS,9917.02316569,9923.23988,,RESID:37@27,,,1
7836,SC61B_HUMAN,P60468,Protein transport protein Sec61 subunit beta,P60468,,MPGPTPSGTNVGSSGRSPSKAVAARAAGSTVRQRKNASCGTRSAGRTTSAGTGGMWRFYTEDSPGLKVGPVPVLVMSLLFIASVFMLHIWGKYTRS,1,95,95,PGPTPSGTNVGSSGRSPSKAVAARAAGSTVRQRKNASCGTRSAGRTTSAGTGGMWRFYTEDSPGLKVGPVPVLVMSLLFIASVFMLHIWGKYTRS,9996.98949669,10003.21988,,RESID:37@12|RESID:37@15,,,1
8320,SC61B_HUMAN,P60468,Protein transport protein Sec61 subunit beta,P60468,,MPGPTPSGTNVGSSGRSPSKAVAARAAGSTVRQRKNASCGTRSAGRTTSAGTGGMWRFYTEDSPGLKVGPVPVLVMSLLFIASVFMLHIWGKYTRS,1,95,95,PGPTPSGTNVGSSGRSPSKAVAARAAGSTVRQRKNASCGTRSAGRTTSAGTGGMWRFYTEDSPGLKVGPVPVLVMSLLFIASVFMLHIWGKYTRS,10197.26339669,10203.68988,,RESID:50@0|RESID:38@3|RESID:60@37,,,1
8400,SC61B_HUMAN,P60468,Protein transport protein Sec61 subunit beta,P60468,,MPGPTPSGTNVGSSGRSPSKAVAARAAGSTVRQRKNASCGTRSAGRTTSAGTGGMWRFYTEDSPGLKVGPVPVLVMSLLFIASVFMLHIWGKYTRS,0,95,96,MPGPTPSGTNVGSSGRSPSKAVAARAAGSTVRQRKNASCGTRSAGRTTSAGTGGMWRFYTEDSPGLKVGPVPVLVMSLLFIASVFMLHIWGKYTRS,10328.30388669,10334.88248,,RESID:49@0|RESID:38@4|RESID:60@38,,,1
8637,SC61B_HUMAN,P60468,Protein transport protein Sec61 subunit beta,P60468,,MPGPTPSGTNVGSSGRSPSKAVAARAAGSTVRQRKNASCGTRSAGRTTSAGTGGMWRFYTEDSPGLKVGPVPVLVMSLLFIASVFMLHIWGKYTRS,1,95,95,PGPTPSGTNVGSSGRSPSKAVAARAAGSTVRQRKNASCGTRSAGRTTSAGTGGMWRFYTEDSPGLKVGPVPVLVMSLLFIASVFMLHIWGKYTRS,10117.29706569,10123.70988,,RESID:50@0|RESID:60@37,,,1
12381,SC61B_HUMAN,P60468,Protein transport protein Sec61 subunit beta,P60468,,MPGPTPSGTNVGSSGRSPSKAVAARAAGSTVRQRKNASCGTRSAGRTTSAGTGGMWRFYTEDSPGLKVGPVPVLVMSLLFIASVFMLHIWGKYTRS,1,95,95,PGPTPSGTNVGSSGRSPSKAVAARAAGSTVRQRKNASCGTRSAGRTTSAGTGGMWRFYTEDSPGLKVGPVPVLVMSLLFIASVFMLHIWGKYTRS,9917.02316569,9923.23988,,RESID:37@5,,,1
12397,SC61B_HUMAN,P60468,Protein transport protein Sec61 subunit beta,P60468,,MPGPTPSGTNVGSSGRSPSKAVAARAAGSTVRQRKNASCGTRSAGRTTSAGTGGMWRFYTEDSPGLKVGPVPVLVMSLLFIASVFMLHIWGKYTRS,1,95,95,PGPTPSGTNVGSSGRSPSKAVAARAAGSTVRQRKNASCGTRSAGRTTSAGTGGMWRFYTEDSPGLKVGPVPVLVMSLLFIASVFMLHIWGKYTRS,9917.02316569,9923.23988,,RESID:37@12,,,1
12553,SC61B_HUMAN,P60468,Protein transport protein Sec61 subunit beta,P60468,,MPGPTPSGTNVGSSGRSPSKAVAARAAGSTVRQRKNASCGTRSAGRTTSAGTGGMWRFYTEDSPGLKVGPVPVLVMSLLFIASVFMLHIWGKYTRS,0,95,96,MPGPTPSGTNVGSSGRSPSKAVAARAAGSTVRQRKNASCGTRSAGRTTSAGTGGMWRFYTEDSPGLKVGPVPVLVMSLLFIASVFMLHIWGKYTRS,10048.06365569,10054.43248,,RESID:37@6,,,1
12554,SC61B_HUMAN,P60468,Protein transport protein Sec61 subunit beta,P60468,,MPGPTPSGTNVGSSGRSPSKAVAARAAGSTVRQRKNASCGTRSAGRTTSAGTGGMWRFYTEDSPGLKVGPVPVLVMSLLFIASVFMLHIWGKYTRS,0,95,96,MPGPTPSGTNVGSSGRSPSKAVAARAAGSTVRQRKNASCGTRSAGRTTSAGTGGMWRFYTEDSPGLKVGPVPVLVMSLLFIASVFMLHIWGKYTRS,10170.04055169,10176.45248,,RESID:49@0|RESID:37@6|RESID:37@12,,,1
12567,SC61B_HUMAN,P60468,Protein transport protein Sec61 subunit beta,P60468,,MPGPTPSGTNVGSSGRSPSKAVAARAAGSTVRQRKNASCGTRSAGRTTSAGTGGMWRFYTEDSPGLKVGPVPVLVMSLLFIASVFMLHIWGKYTRS,0,95,96,MPGPTPSGTNVGSSGRSPSKAVAARAAGSTVRQRKNASCGTRSAGRTTSAGTGGMWRFYTEDSPGLKVGPVPVLVMSLLFIASVFMLHIWGKYTRS,10090.07422069,10096.47248,,RESID:49@0|RESID:37@6,,,1
12680,SC61B_HUMAN,P60468,Protein transport protein Sec61 subunit beta,P60468,,MPGPTPSGTNVGSSGRSPSKAVAARAAGSTVRQRKNASCGTRSAGRTTSAGTGGMWRFYTEDSPGLKVGPVPVLVMSLLFIASVFMLHIWGKYTRS,1,95,95,PGPTPSGTNVGSSGRSPSKAVAARAAGSTVRQRKNASCGTRSAGRTTSAGTGGMWRFYTEDSPGLKVGPVPVLVMSLLFIASVFMLHIWGKYTRS,10039.00006169,10045.25988,,RESID:50@0|RESID:37@5|RESID:37@11,,,1
12985,SC61B_HUMAN,P60468,Protein transport protein Sec61 subunit beta,P60468,,MPGPTPSGTNVGSSGRSPSKAVAARAAGSTVRQRKNASCGTRSAGRTTSAGTGGMWRFYTEDSPGLKVGPVPVLVMSLLFIASVFMLHIWGKYTRS,1,95,95,PGPTPSGTNVGSSGRSPSKAVAARAAGSTVRQRKNASCGTRSAGRTTSAGTGGMWRFYTEDSPGLKVGPVPVLVMSLLFIASVFMLHIWGKYTRS,9959.03373069,9965.27988000001,,RESID:50@0|RESID:37@5,,,1
13238,SC61B_HUMAN,P60468,Protein transport protein Sec61 subunit beta,P60468,,MPGPTPSGTNVGSSGRSPSKAVAARAAGSTVRQRKNASCGTRSAGRTTSAGTGGMWRFYTEDSPGLKVGPVPVLVMSLLFIASVFMLHIWGKYTRS,1,95,95,PGPTPSGTNVGSSGRSPSKAVAARAAGSTVRQRKNASCGTRSAGRTTSAGTGGMWRFYTEDSPGLKVGPVPVLVMSLLFIASVFMLHIWGKYTRS,9917.02316569,9923.23988,,RESID:37@15,,,1
13315,SC61B_HUMAN,P60468,Protein transport protein Sec61 subunit beta,P60468,,MPGPTPSGTNVGSSGRSPSKAVAARAAGSTVRQRKNASCGTRSAGRTTSAGTGGMWRFYTEDSPGLKVGPVPVLVMSLLFIASVFMLHIWGKYTRS,1,95,95,PGPTPSGTNVGSSGRSPSKAVAARAAGSTVRQRKNASCGTRSAGRTTSAGTGGMWRFYTEDSPGLKVGPVPVLVMSLLFIASVFMLHIWGKYTRS,10076.95582769,10083.19988,,RESID:37@11|RESID:37@12|RESID:37@15,,,1
13327,SC61B_HUMAN,P60468,Protein transport protein Sec61 subunit beta,P60468,,MPGPTPSGTNVGSSGRSPSKAVAARAAGSTVRQRKNASCGTRSAGRTTSAGTGGMWRFYTEDSPGLKVGPVPVLVMSLLFIASVFMLHIWGKYTRS,1,95,95,PGPTPSGTNVGSSGRSPSKAVAARAAGSTVRQRKNASCGTRSAGRTTSAGTGGMWRFYTEDSPGLKVGPVPVLVMSLLFIASVFMLHIWGKYTRS,9996.98949669,10003.21988,,RESID:37@5|RESID:37@11,,,1
13344,SC61B_HUMAN,P60468,Protein transport protein Sec61 subunit beta,P60468,,MPGPTPSGTNVGSSGRSPSKAVAARAAGSTVRQRKNASCGTRSAGRTTSAGTGGMWRFYTEDSPGLKVGPVPVLVMSLLFIASVFMLHIWGKYTRS,1,95,95,PGPTPSGTNVGSSGRSPSKAVAARAAGSTVRQRKNASCGTRSAGRTTSAGTGGMWRFYTEDSPGLKVGPVPVLVMSLLFIASVFMLHIWGKYTRS,10118.96639269,10125.23988,,RESID:50@0|RESID:37@5|RESID:37@11|RESID:37@12,,,1
13784,SC61B_HUMAN,P60468,Protein transport protein Sec61 subunit beta,P60468,,MPGPTPSGTNVGSSGRSPSKAVAARAAGSTVRQRKNASCGTRSAGRTTSAGTGGMWRFYTEDSPGLKVGPVPVLVMSLLFIASVFMLHIWGKYTRS,1,95,95,PGPTPSGTNVGSSGRSPSKAVAARAAGSTVRQRKNASCGTRSAGRTTSAGTGGMWRFYTEDSPGLKVGPVPVLVMSLLFIASVFMLHIWGKYTRS,9996.98949669,10003.21988,,RESID:37@11|RESID:37@12,,,1
13888,SC61B_HUMAN,P60468,Protein transport protein Sec61 subunit beta,P60468,,MPGPTPSGTNVGSSGRSPSKAVAARAAGSTVRQRKNASCGTRSAGRTTSAGTGGMWRFYTEDSPGLKVGPVPVLVMSLLFIASVFMLHIWGKYTRS,1,95,95,PGPTPSGTNVGSSGRSPSKAVAARAAGSTVRQRKNASCGTRSAGRTTSAGTGGMWRFYTEDSPGLKVGPVPVLVMSLLFIASVFMLHIWGKYTRS,10198.93272369,10205.21988,,RESID:50@0|RESID:37@5|RESID:37@11|RESID:37@12|RESID:37@15,,,1
13938,SC61B_HUMAN,P60468,Protein transport protein Sec61 subunit beta,P60468,,MPGPTPSGTNVGSSGRSPSKAVAARAAGSTVRQRKNASCGTRSAGRTTSAGTGGMWRFYTEDSPGLKVGPVPVLVMSLLFIASVFMLHIWGKYTRS,0,95,96,MPGPTPSGTNVGSSGRSPSKAVAARAAGSTVRQRKNASCGTRSAGRTTSAGTGGMWRFYTEDSPGLKVGPVPVLVMSLLFIASVFMLHIWGKYTRS,10128.02998669,10134.41248,,RESID:37@6|RESID:37@12,,,1
14899,SC61B_HUMAN,P60468,Protein transport protein Sec61 subunit beta,P60468,,MPGPTPSGTNVGSSGRSPSKAVAARAAGSTVRQRKNASCGTRSAGRTTSAGTGGMWRFYTEDSPGLKVGPVPVLVMSLLFIASVFMLHIWGKYTRS,0,95,96,MPGPTPSGTNVGSSGRSPSKAVAARAAGSTVRQRKNASCGTRSAGRTTSAGTGGMWRFYTEDSPGLKVGPVPVLVMSLLFIASVFMLHIWGKYTRS,10287.96264869,10294.37248,,RESID:37@6|RESID:37@12|RESID:37@13|RESID:37@16,,,1
17769,SC61B_HUMAN,P60468,Protein transport protein Sec61 subunit beta,P60468,,MPGPTPSGTNVGSSGRSPSKAVAARAAGSTVRQRKNASCGTRSAGRTTSAGTGGMWRFYTEDSPGLKVGPVPVLVMSLLFIASVFMLHIWGKYTRS,0,95,96,MPGPTPSGTNVGSSGRSPSKAVAARAAGSTVRQRKNASCGTRSAGRTTSAGTGGMWRFYTEDSPGLKVGPVPVLVMSLLFIASVFMLHIWGKYTRS,10048.06366,10054.43248,,RESID:37@16,,,0
17782,SC61B_HUMAN,P60468,Protein transport protein Sec61 subunit beta,P60468,,MPGPTPSGTNVGSSGRSPSKAVAARAAGSTVRQRKNASCGTRSAGRTTSAGTGGMWRFYTEDSPGLKVGPVPVLVMSLLFIASVFMLHIWGKYTRS,0,95,96,MPGPTPSGTNVGSSGRSPSKAVAARAAGSTVRQRKNASCGTRSAGRTTSAGTGGMWRFYTEDSPGLKVGPVPVLVMSLLFIASVFMLHIWGKYTRS,10010.10789,10016.49248,,,PSI-MOD:1458,,0
