PFR,UniProt Id,Entry Accession,Entry Description,Isoform Accession,Isoform Description,Isoform Sequence,Start,End,Length,Proteoform Sequence,Monoisotopic Mass,Average Mass,Sequence Modifications,PTMs,N-Terminal,C-Terminal,Star
1544,RL27_HUMAN,P61353,60S ribosomal protein L27,P61353,,MGKFMKPGKVVLVLAGRYSGRKAVIVKNIDDGTSDRPYSHALVAGIDRYPRKVTAAMGKKKIAKRSKIKSFVKVYNYNHLMPTRYSVDIPLDKTVVNKDVFRDPALKRKARREAKVKFEERYKTGKNKWFFQKLRF,1,135,135,GKFMKPGKVVLVLAGRYSGRKAVIVKNIDDGTSDRPYSHALVAGIDRYPRKVTAAMGKKKIAKRSKIKSFVKVYNYNHLMPTRYSVDIPLDKTVVNKDVFRDPALKRKARREAKVKFEERYKTGKNKWFFQKLRF,15656.70681469,15666.53018,,,,,1
3129,RL27_HUMAN,P61353,60S ribosomal protein L27,P61353,,MGKFMKPGKVVLVLAGRYSGRKAVIVKNIDDGTSDRPYSHALVAGIDRYPRKVTAAMGKKKIAKRSKIKSFVKVYNYNHLMPTRYSVDIPLDKTVVNKDVFRDPALKRKARREAKVKFEERYKTGKNKWFFQKLRF,0,135,136,MGKFMKPGKVVLVLAGRYSGRKAVIVKNIDDGTSDRPYSHALVAGIDRYPRKVTAAMGKKKIAKRSKIKSFVKVYNYNHLMPTRYSVDIPLDKTVVNKDVFRDPALKRKARREAKVKFEERYKTGKNKWFFQKLRF,15829.75786969,15839.76278,,RESID:49@0,,,1
3333,RL27_HUMAN,P61353,60S ribosomal protein L27,P61353,,MGKFMKPGKVVLVLAGRYSGRKAVIVKNIDDGTSDRPYSHALVAGIDRYPRKVTAAMGKKKIAKRSKIKSFVKVYNYNHLMPTRYSVDIPLDKTVVNKDVFRDPALKRKARREAKVKFEERYKTGKNKWFFQKLRF,0,135,136,MGKFMKPGKVVLVLAGRYSGRKAVIVKNIDDGTSDRPYSHALVAGIDRYPRKVTAAMGKKKIAKRSKIKSFVKVYNYNHLMPTRYSVDIPLDKTVVNKDVFRDPALKRKARREAKVKFEERYKTGKNKWFFQKLRF,15787.74730469,15797.72278,,,,,1
3671,RL27_HUMAN,P61353,60S ribosomal protein L27,P61353,,MGKFMKPGKVVLVLAGRYSGRKAVIVKNIDDGTSDRPYSHALVAGIDRYPRKVTAAMGKKKIAKRSKIKSFVKVYNYNHLMPTRYSVDIPLDKTVVNKDVFRDPALKRKARREAKVKFEERYKTGKNKWFFQKLRF,1,135,135,GKFMKPGKVVLVLAGRYSGRKAVIVKNIDDGTSDRPYSHALVAGIDRYPRKVTAAMGKKKIAKRSKIKSFVKVYNYNHLMPTRYSVDIPLDKTVVNKDVFRDPALKRKARREAKVKFEERYKTGKNKWFFQKLRF,15698.71737969,15708.57018,,RESID:46@0,,,1
3672,RL27_HUMAN,P61353,60S ribosomal protein L27,P61353,,MGKFMKPGKVVLVLAGRYSGRKAVIVKNIDDGTSDRPYSHALVAGIDRYPRKVTAAMGKKKIAKRSKIKSFVKVYNYNHLMPTRYSVDIPLDKTVVNKDVFRDPALKRKARREAKVKFEERYKTGKNKWFFQKLRF,1,135,135,GKFMKPGKVVLVLAGRYSGRKAVIVKNIDDGTSDRPYSHALVAGIDRYPRKVTAAMGKKKIAKRSKIKSFVKVYNYNHLMPTRYSVDIPLDKTVVNKDVFRDPALKRKARREAKVKFEERYKTGKNKWFFQKLRF,15782.73850969,15792.65018,,RESID:46@0|RESID:55@25|RESID:55@91,,,1
3692,RL27_HUMAN,P61353,60S ribosomal protein L27,P61353,,MGKFMKPGKVVLVLAGRYSGRKAVIVKNIDDGTSDRPYSHALVAGIDRYPRKVTAAMGKKKIAKRSKIKSFVKVYNYNHLMPTRYSVDIPLDKTVVNKDVFRDPALKRKARREAKVKFEERYKTGKNKWFFQKLRF,1,135,135,GKFMKPGKVVLVLAGRYSGRKAVIVKNIDDGTSDRPYSHALVAGIDRYPRKVTAAMGKKKIAKRSKIKSFVKVYNYNHLMPTRYSVDIPLDKTVVNKDVFRDPALKRKARREAKVKFEERYKTGKNKWFFQKLRF,15740.72794469,15750.61018,,RESID:46@0|RESID:55@25,,,1
12330,RL27_HUMAN,P61353,60S ribosomal protein L27,P61353,,MGKFMKPGKVVLVLAGRYSGRKAVIVKNIDDGTSDRPYSHALVAGIDRYPRKVTAAMGKKKIAKRSKIKSFVKVYNYNHLMPTRYSVDIPLDKTVVNKDVFRDPALKRKARREAKVKFEERYKTGKNKWFFQKLRF,1,135,135,GKFMKPGKVVLVLAGRYSGRKAVIVKNIDDGTSDRPYSHALVAGIDRYPRKVTAAMGKKKIAKRSKIKSFVKVYNYNHLMPTRYSVDIPLDKTVVNKDVFRDPALKRKARREAKVKFEERYKTGKNKWFFQKLRF,15698.71737969,15708.57018,,RESID:55@25,,,1
13187,RL27_HUMAN,P61353,60S ribosomal protein L27,P61353,,MGKFMKPGKVVLVLAGRYSGRKAVIVKNIDDGTSDRPYSHALVAGIDRYPRKVTAAMGKKKIAKRSKIKSFVKVYNYNHLMPTRYSVDIPLDKTVVNKDVFRDPALKRKARREAKVKFEERYKTGKNKWFFQKLRF,1,135,135,GKFMKPGKVVLVLAGRYSGRKAVIVKNIDDGTSDRPYSHALVAGIDRYPRKVTAAMGKKKIAKRSKIKSFVKVYNYNHLMPTRYSVDIPLDKTVVNKDVFRDPALKRKARREAKVKFEERYKTGKNKWFFQKLRF,15698.71737969,15708.57018,,RESID:55@91,,,1
13630,RL27_HUMAN,P61353,60S ribosomal protein L27,P61353,,MGKFMKPGKVVLVLAGRYSGRKAVIVKNIDDGTSDRPYSHALVAGIDRYPRKVTAAMGKKKIAKRSKIKSFVKVYNYNHLMPTRYSVDIPLDKTVVNKDVFRDPALKRKARREAKVKFEERYKTGKNKWFFQKLRF,0,135,136,MGKFMKPGKVVLVLAGRYSGRKAVIVKNIDDGTSDRPYSHALVAGIDRYPRKVTAAMGKKKIAKRSKIKSFVKVYNYNHLMPTRYSVDIPLDKTVVNKDVFRDPALKRKARREAKVKFEERYKTGKNKWFFQKLRF,15829.75786969,15839.76278,,RESID:55@26,,,1
17107,RL27_HUMAN,P61353,60S ribosomal protein L27,P61353,,MGKFMKPGKVVLVLAGRYSGRKAVIVKNIDDGTSDRPYSHALVAGIDRYPRKVTAAMGKKKIAKRSKIKSFVKVYNYNHLMPTRYSVDIPLDKTVVNKDVFRDPALKRKARREAKVKFEERYKTGKNKWFFQKLRF,103,135,33,PALKRKARREAKVKFEERYKTGKNKWFFQKLRF,4183.391115,4185.98368,,,,,0
17844,RL27_HUMAN,P61353,60S ribosomal protein L27,P61353,,MGKFMKPGKVVLVLAGRYSGRKAVIVKNIDDGTSDRPYSHALVAGIDRYPRKVTAAMGKKKIAKRSKIKSFVKVYNYNHLMPTRYSVDIPLDKTVVNKDVFRDPALKRKARREAKVKFEERYKTGKNKWFFQKLRF,1,20,20,GKFMKPGKVVLVLAGRYSGR,2162.250985,2163.65568,,,,,0
18252,RL27_HUMAN,P61353,60S ribosomal protein L27,P61353,,MGKFMKPGKVVLVLAGRYSGRKAVIVKNIDDGTSDRPYSHALVAGIDRYPRKVTAAMGKKKIAKRSKIKSFVKVYNYNHLMPTRYSVDIPLDKTVVNKDVFRDPALKRKARREAKVKFEERYKTGKNKWFFQKLRF,0,135,136,MGKFMKPGKVVLVLAGRYSGRKAVIVKNIDDGTSDRPYSHALVAGIDRYPRKVTAAMGKKKIAKRSKIKSFVKVYNYNHLMPTRYSVDIPLDKTVVNKDVFRDPALKRKARREAKVKFEERYKTGKNKWFFQKLRF,15829.75787,15839.76278,,RESID:55@92,,,0
73312,RL27_HUMAN,P61353,60S ribosomal protein L27,P61353,,MGKFMKPGKVVLVLAGRYSGRKAVIVKNIDDGTSDRPYSHALVAGIDRYPRKVTAAMGKKKIAKRSKIKSFVKVYNYNHLMPTRYSVDIPLDKTVVNKDVFRDPALKRKARREAKVKFEERYKTGKNKWFFQKLRF,1,54,54,GKFMKPGKVVLVLAGRYSGRKAVIVKNIDDGTSDRPYSHALVAGIDRYPRKVTA,5869.24163469,5872.87878,,,,,1
