PFR,UniProt Id,Entry Accession,Entry Description,Isoform Accession,Isoform Description,Isoform Sequence,Start,End,Length,Proteoform Sequence,Monoisotopic Mass,Average Mass,Sequence Modifications,PTMs,N-Terminal,C-Terminal,Star
2739,RL37A_HUMAN,P61513,60S ribosomal protein L37a,P61513,,MAKRTKKVGIVGKYGTRYGASLRKMVKKIEISQHAKYTCSFCGKTKMKRRAVGIWHCGSCMKTVAGGAWTYNTTSAVTVKSAIRRLKELKDQ,1,91,91,AKRTKKVGIVGKYGTRYGASLRKMVKKIEISQHAKYTCSFCGKTKMKRRAVGIWHCGSCMKTVAGGAWTYNTTSAVTVKSAIRRLKELKDQ,10137.43401469,10144.06228,,,,,1
6290,RL37A_HUMAN,P61513,60S ribosomal protein L37a,P61513,,MAKRTKKVGIVGKYGTRYGASLRKMVKKIEISQHAKYTCSFCGKTKMKRRAVGIWHCGSCMKTVAGGAWTYNTTSAVTVKSAIRRLKELKDQ,0,91,92,MAKRTKKVGIVGKYGTRYGASLRKMVKKIEISQHAKYTCSFCGKTKMKRRAVGIWHCGSCMKTVAGGAWTYNTTSAVTVKSAIRRLKELKDQ,10310.48506969,10317.29488,,RESID:49@0,,,1
9915,RL37A_HUMAN,P61513,60S ribosomal protein L37a,P61513,,MAKRTKKVGIVGKYGTRYGASLRKMVKKIEISQHAKYTCSFCGKTKMKRRAVGIWHCGSCMKTVAGGAWTYNTTSAVTVKSAIRRLKELKDQ,0,91,92,MAKRTKKVGIVGKYGTRYGASLRKMVKKIEISQHAKYTCSFCGKTKMKRRAVGIWHCGSCMKTVAGGAWTYNTTSAVTVKSAIRRLKELKDQ,10268.47450469,10275.25488,,,,,1
18053,RL37A_HUMAN,P61513,60S ribosomal protein L37a,P61513,,MAKRTKKVGIVGKYGTRYGASLRKMVKKIEISQHAKYTCSFCGKTKMKRRAVGIWHCGSCMKTVAGGAWTYNTTSAVTVKSAIRRLKELKDQ,1,27,27,AKRTKKVGIVGKYGTRYGASLRKMVKK,3022.806565,3024.71128,,,,,0
18087,RL37A_HUMAN,P61513,60S ribosomal protein L37a,P61513,,MAKRTKKVGIVGKYGTRYGASLRKMVKKIEISQHAKYTCSFCGKTKMKRRAVGIWHCGSCMKTVAGGAWTYNTTSAVTVKSAIRRLKELKDQ,1,91,91,AKRTKKVGIVGKYGTRYGASLRKMVKKIEISQHAKYTCSFCGKTKMKRRAVGIWHCGSCMKTVAGGAWTYNTTSAVTVKSAIRRLKELKDQ,10179.44458,10186.10228,,,PSI-MOD:1458,,0
18121,RL37A_HUMAN,P61513,60S ribosomal protein L37a,P61513,,MAKRTKKVGIVGKYGTRYGASLRKMVKKIEISQHAKYTCSFCGKTKMKRRAVGIWHCGSCMKTVAGGAWTYNTTSAVTVKSAIRRLKELKDQ,1,26,26,AKRTKKVGIVGKYGTRYGASLRKMVK,2894.711605,2896.53718,,,,,0
29404,RL37A_HUMAN,P61513,60S ribosomal protein L37a,P61513,,MAKRTKKVGIVGKYGTRYGASLRKMVKKIEISQHAKYTCSFCGKTKMKRRAVGIWHCGSCMKTVAGGAWTYNTTSAVTVKSAIRRLKELKDQ,1,37,37,AKRTKKVGIVGKYGTRYGASLRKMVKKIEISQHAKYT,4193.40987469,4196.02958,,,,,1
73291,RL37A_HUMAN,P61513,60S ribosomal protein L37a,P61513,,MAKRTKKVGIVGKYGTRYGASLRKMVKKIEISQHAKYTCSFCGKTKMKRRAVGIWHCGSCMKTVAGGAWTYNTTSAVTVKSAIRRLKELKDQ,1,38,38,AKRTKKVGIVGKYGTRYGASLRKMVKKIEISQHAKYTC,4296.41906469,4299.16838,,,,,1
