PFR,UniProt Id,Entry Accession,Entry Description,Isoform Accession,Isoform Description,Isoform Sequence,Start,End,Length,Proteoform Sequence,Monoisotopic Mass,Average Mass,Sequence Modifications,PTMs,N-Terminal,C-Terminal,Star
1003,CH10_HUMAN,P61604,10 kDa heat shock protein; mitochondrial,P61604,,MAGQAFRKFLPLFDRVLVERSAAETVTKGGIMLPEKSQGKVLQATVVAVGSGSKGKGGEIQPVSVKVGDKVLLPEYGGTKVVLDDKDYFLFRDGDILGKYVD,1,101,101,AGQAFRKFLPLFDRVLVERSAAETVTKGGIMLPEKSQGKVLQATVVAVGSGSKGKGGEIQPVSVKVGDKVLLPEYGGTKVVLDDKDYFLFRDGDILGKYVD,10835.84097969,10842.53928,,RESID:41@0,,,3
1219,CH10_HUMAN,P61604,10 kDa heat shock protein; mitochondrial,P61604,,MAGQAFRKFLPLFDRVLVERSAAETVTKGGIMLPEKSQGKVLQATVVAVGSGSKGKGGEIQPVSVKVGDKVLLPEYGGTKVVLDDKDYFLFRDGDILGKYVD,0,101,102,MAGQAFRKFLPLFDRVLVERSAAETVTKGGIMLPEKSQGKVLQATVVAVGSGSKGKGGEIQPVSVKVGDKVLLPEYGGTKVVLDDKDYFLFRDGDILGKYVD,10966.88146969,10973.73188,,RESID:49@0,,,1
1322,CH10_HUMAN,P61604,10 kDa heat shock protein; mitochondrial,P61604,,MAGQAFRKFLPLFDRVLVERSAAETVTKGGIMLPEKSQGKVLQATVVAVGSGSKGKGGEIQPVSVKVGDKVLLPEYGGTKVVLDDKDYFLFRDGDILGKYVD,1,101,101,AGQAFRKFLPLFDRVLVERSAAETVTKGGIMLPEKSQGKVLQATVVAVGSGSKGKGGEIQPVSVKVGDKVLLPEYGGTKVVLDDKDYFLFRDGDILGKYVD,10877.85154469,10884.57928,,RESID:41@0|RESID:55@54,,,1
3992,CH10_HUMAN,P61604,10 kDa heat shock protein; mitochondrial,P61604,,MAGQAFRKFLPLFDRVLVERSAAETVTKGGIMLPEKSQGKVLQATVVAVGSGSKGKGGEIQPVSVKVGDKVLLPEYGGTKVVLDDKDYFLFRDGDILGKYVD,1,101,101,AGQAFRKFLPLFDRVLVERSAAETVTKGGIMLPEKSQGKVLQATVVAVGSGSKGKGGEIQPVSVKVGDKVLLPEYGGTKVVLDDKDYFLFRDGDILGKYVD,10919.86210969,10926.61928,,RESID:41@0|RESID:55@54|RESID:55@68,,,1
6890,CH10_HUMAN,P61604,10 kDa heat shock protein; mitochondrial,P61604,,MAGQAFRKFLPLFDRVLVERSAAETVTKGGIMLPEKSQGKVLQATVVAVGSGSKGKGGEIQPVSVKVGDKVLLPEYGGTKVVLDDKDYFLFRDGDILGKYVD,1,101,101,AGQAFRKFLPLFDRVLVERSAAETVTKGGIMLPEKSQGKVLQATVVAVGSGSKGKGGEIQPVSVKVGDKVLLPEYGGTKVVLDDKDYFLFRDGDILGKYVD,10835.84097969,10842.53928,,RESID:55@54,,,1
7016,CH10_HUMAN,P61604,10 kDa heat shock protein; mitochondrial,P61604,,MAGQAFRKFLPLFDRVLVERSAAETVTKGGIMLPEKSQGKVLQATVVAVGSGSKGKGGEIQPVSVKVGDKVLLPEYGGTKVVLDDKDYFLFRDGDILGKYVD,1,101,101,AGQAFRKFLPLFDRVLVERSAAETVTKGGIMLPEKSQGKVLQATVVAVGSGSKGKGGEIQPVSVKVGDKVLLPEYGGTKVVLDDKDYFLFRDGDILGKYVD,10957.81787569,10964.55928,,RESID:41@0|RESID:55@54|RESID:39@74,,,1
7098,CH10_HUMAN,P61604,10 kDa heat shock protein; mitochondrial,P61604,,MAGQAFRKFLPLFDRVLVERSAAETVTKGGIMLPEKSQGKVLQATVVAVGSGSKGKGGEIQPVSVKVGDKVLLPEYGGTKVVLDDKDYFLFRDGDILGKYVD,1,101,101,AGQAFRKFLPLFDRVLVERSAAETVTKGGIMLPEKSQGKVLQATVVAVGSGSKGKGGEIQPVSVKVGDKVLLPEYGGTKVVLDDKDYFLFRDGDILGKYVD,11079.79477169,11086.57928,,RESID:41@0|RESID:55@68|RESID:39@74|RESID:55@84|RESID:39@86,,,1
7106,CH10_HUMAN,P61604,10 kDa heat shock protein; mitochondrial,P61604,,MAGQAFRKFLPLFDRVLVERSAAETVTKGGIMLPEKSQGKVLQATVVAVGSGSKGKGGEIQPVSVKVGDKVLLPEYGGTKVVLDDKDYFLFRDGDILGKYVD,1,101,101,AGQAFRKFLPLFDRVLVERSAAETVTKGGIMLPEKSQGKVLQATVVAVGSGSKGKGGEIQPVSVKVGDKVLLPEYGGTKVVLDDKDYFLFRDGDILGKYVD,11121.80533669,11128.61928,,RESID:41@0|RESID:55@54|RESID:55@68|RESID:39@74|RESID:55@84|RESID:39@86,,,1
7198,CH10_HUMAN,P61604,10 kDa heat shock protein; mitochondrial,P61604,,MAGQAFRKFLPLFDRVLVERSAAETVTKGGIMLPEKSQGKVLQATVVAVGSGSKGKGGEIQPVSVKVGDKVLLPEYGGTKVVLDDKDYFLFRDGDILGKYVD,1,101,101,AGQAFRKFLPLFDRVLVERSAAETVTKGGIMLPEKSQGKVLQATVVAVGSGSKGKGGEIQPVSVKVGDKVLLPEYGGTKVVLDDKDYFLFRDGDILGKYVD,11041.83900569,11048.63928,,RESID:41@0|RESID:55@54|RESID:55@68|RESID:39@74|RESID:55@84,,,1
7237,CH10_HUMAN,P61604,10 kDa heat shock protein; mitochondrial,P61604,,MAGQAFRKFLPLFDRVLVERSAAETVTKGGIMLPEKSQGKVLQATVVAVGSGSKGKGGEIQPVSVKVGDKVLLPEYGGTKVVLDDKDYFLFRDGDILGKYVD,1,101,101,AGQAFRKFLPLFDRVLVERSAAETVTKGGIMLPEKSQGKVLQATVVAVGSGSKGKGGEIQPVSVKVGDKVLLPEYGGTKVVLDDKDYFLFRDGDILGKYVD,11079.79477169,11086.57928,,RESID:41@0|RESID:55@68|RESID:39@74|RESID:39@86|RESID:55@97,,,1
7264,CH10_HUMAN,P61604,10 kDa heat shock protein; mitochondrial,P61604,,MAGQAFRKFLPLFDRVLVERSAAETVTKGGIMLPEKSQGKVLQATVVAVGSGSKGKGGEIQPVSVKVGDKVLLPEYGGTKVVLDDKDYFLFRDGDILGKYVD,1,101,101,AGQAFRKFLPLFDRVLVERSAAETVTKGGIMLPEKSQGKVLQATVVAVGSGSKGKGGEIQPVSVKVGDKVLLPEYGGTKVVLDDKDYFLFRDGDILGKYVD,10961.87267469,10968.65928,,RESID:41@0|RESID:55@54|RESID:55@68|RESID:55@84,,,1
7390,CH10_HUMAN,P61604,10 kDa heat shock protein; mitochondrial,P61604,,MAGQAFRKFLPLFDRVLVERSAAETVTKGGIMLPEKSQGKVLQATVVAVGSGSKGKGGEIQPVSVKVGDKVLLPEYGGTKVVLDDKDYFLFRDGDILGKYVD,1,101,101,AGQAFRKFLPLFDRVLVERSAAETVTKGGIMLPEKSQGKVLQATVVAVGSGSKGKGGEIQPVSVKVGDKVLLPEYGGTKVVLDDKDYFLFRDGDILGKYVD,10877.85154469,10884.57928,,RESID:41@0|RESID:55@68,,,1
7422,CH10_HUMAN,P61604,10 kDa heat shock protein; mitochondrial,P61604,,MAGQAFRKFLPLFDRVLVERSAAETVTKGGIMLPEKSQGKVLQATVVAVGSGSKGKGGEIQPVSVKVGDKVLLPEYGGTKVVLDDKDYFLFRDGDILGKYVD,1,101,101,AGQAFRKFLPLFDRVLVERSAAETVTKGGIMLPEKSQGKVLQATVVAVGSGSKGKGGEIQPVSVKVGDKVLLPEYGGTKVVLDDKDYFLFRDGDILGKYVD,11041.83900569,11048.63928,,RESID:41@0|RESID:55@54|RESID:55@68|RESID:39@74|RESID:55@97,,,1
7443,CH10_HUMAN,P61604,10 kDa heat shock protein; mitochondrial,P61604,,MAGQAFRKFLPLFDRVLVERSAAETVTKGGIMLPEKSQGKVLQATVVAVGSGSKGKGGEIQPVSVKVGDKVLLPEYGGTKVVLDDKDYFLFRDGDILGKYVD,1,101,101,AGQAFRKFLPLFDRVLVERSAAETVTKGGIMLPEKSQGKVLQATVVAVGSGSKGKGGEIQPVSVKVGDKVLLPEYGGTKVVLDDKDYFLFRDGDILGKYVD,11083.84957069,11090.67928,,RESID:41@0|RESID:55@54|RESID:55@68|RESID:39@74|RESID:55@84|RESID:55@97,,,1
7718,CH10_HUMAN,P61604,10 kDa heat shock protein; mitochondrial,P61604,,MAGQAFRKFLPLFDRVLVERSAAETVTKGGIMLPEKSQGKVLQATVVAVGSGSKGKGGEIQPVSVKVGDKVLLPEYGGTKVVLDDKDYFLFRDGDILGKYVD,1,101,101,AGQAFRKFLPLFDRVLVERSAAETVTKGGIMLPEKSQGKVLQATVVAVGSGSKGKGGEIQPVSVKVGDKVLLPEYGGTKVVLDDKDYFLFRDGDILGKYVD,10957.81787569,10964.55928,,RESID:41@0|RESID:55@84|RESID:39@86,,,1
7726,CH10_HUMAN,P61604,10 kDa heat shock protein; mitochondrial,P61604,,MAGQAFRKFLPLFDRVLVERSAAETVTKGGIMLPEKSQGKVLQATVVAVGSGSKGKGGEIQPVSVKVGDKVLLPEYGGTKVVLDDKDYFLFRDGDILGKYVD,1,101,101,AGQAFRKFLPLFDRVLVERSAAETVTKGGIMLPEKSQGKVLQATVVAVGSGSKGKGGEIQPVSVKVGDKVLLPEYGGTKVVLDDKDYFLFRDGDILGKYVD,10999.82844069,11006.59928,,RESID:41@0|RESID:55@54|RESID:55@68|RESID:39@74,,,1
8097,CH10_HUMAN,P61604,10 kDa heat shock protein; mitochondrial,P61604,,MAGQAFRKFLPLFDRVLVERSAAETVTKGGIMLPEKSQGKVLQATVVAVGSGSKGKGGEIQPVSVKVGDKVLLPEYGGTKVVLDDKDYFLFRDGDILGKYVD,1,101,101,AGQAFRKFLPLFDRVLVERSAAETVTKGGIMLPEKSQGKVLQATVVAVGSGSKGKGGEIQPVSVKVGDKVLLPEYGGTKVVLDDKDYFLFRDGDILGKYVD,10877.85154469,10884.57928,,RESID:41@0|RESID:55@84,,,1
8098,CH10_HUMAN,P61604,10 kDa heat shock protein; mitochondrial,P61604,,MAGQAFRKFLPLFDRVLVERSAAETVTKGGIMLPEKSQGKVLQATVVAVGSGSKGKGGEIQPVSVKVGDKVLLPEYGGTKVVLDDKDYFLFRDGDILGKYVD,1,101,101,AGQAFRKFLPLFDRVLVERSAAETVTKGGIMLPEKSQGKVLQATVVAVGSGSKGKGGEIQPVSVKVGDKVLLPEYGGTKVVLDDKDYFLFRDGDILGKYVD,10957.81787569,10964.55928,,RESID:41@0|RESID:39@74|RESID:55@84,,,1
8134,CH10_HUMAN,P61604,10 kDa heat shock protein; mitochondrial,P61604,,MAGQAFRKFLPLFDRVLVERSAAETVTKGGIMLPEKSQGKVLQATVVAVGSGSKGKGGEIQPVSVKVGDKVLLPEYGGTKVVLDDKDYFLFRDGDILGKYVD,1,101,101,AGQAFRKFLPLFDRVLVERSAAETVTKGGIMLPEKSQGKVLQATVVAVGSGSKGKGGEIQPVSVKVGDKVLLPEYGGTKVVLDDKDYFLFRDGDILGKYVD,10919.86210969,10926.61928,,RESID:41@0|RESID:55@68|RESID:55@84,,,1
11808,CH10_HUMAN,P61604,10 kDa heat shock protein; mitochondrial,P61604,,MAGQAFRKFLPLFDRVLVERSAAETVTKGGIMLPEKSQGKVLQATVVAVGSGSKGKGGEIQPVSVKVGDKVLLPEYGGTKVVLDDKDYFLFRDGDILGKYVD,0,101,102,MAGQAFRKFLPLFDRVLVERSAAETVTKGGIMLPEKSQGKVLQATVVAVGSGSKGKGGEIQPVSVKVGDKVLLPEYGGTKVVLDDKDYFLFRDGDILGKYVD,10924.87090469,10931.69188,,,,,1
12464,CH10_HUMAN,P61604,10 kDa heat shock protein; mitochondrial,P61604,,MAGQAFRKFLPLFDRVLVERSAAETVTKGGIMLPEKSQGKVLQATVVAVGSGSKGKGGEIQPVSVKVGDKVLLPEYGGTKVVLDDKDYFLFRDGDILGKYVD,1,101,101,AGQAFRKFLPLFDRVLVERSAAETVTKGGIMLPEKSQGKVLQATVVAVGSGSKGKGGEIQPVSVKVGDKVLLPEYGGTKVVLDDKDYFLFRDGDILGKYVD,10915.80731069,10922.51928,,RESID:41@0|RESID:38@77,,,1
12583,CH10_HUMAN,P61604,10 kDa heat shock protein; mitochondrial,P61604,,MAGQAFRKFLPLFDRVLVERSAAETVTKGGIMLPEKSQGKVLQATVVAVGSGSKGKGGEIQPVSVKVGDKVLLPEYGGTKVVLDDKDYFLFRDGDILGKYVD,1,101,101,AGQAFRKFLPLFDRVLVERSAAETVTKGGIMLPEKSQGKVLQATVVAVGSGSKGKGGEIQPVSVKVGDKVLLPEYGGTKVVLDDKDYFLFRDGDILGKYVD,10957.81787569,10964.55928,,RESID:41@0|RESID:55@54|RESID:38@77,,,1
12584,CH10_HUMAN,P61604,10 kDa heat shock protein; mitochondrial,P61604,,MAGQAFRKFLPLFDRVLVERSAAETVTKGGIMLPEKSQGKVLQATVVAVGSGSKGKGGEIQPVSVKVGDKVLLPEYGGTKVVLDDKDYFLFRDGDILGKYVD,1,101,101,AGQAFRKFLPLFDRVLVERSAAETVTKGGIMLPEKSQGKVLQATVVAVGSGSKGKGGEIQPVSVKVGDKVLLPEYGGTKVVLDDKDYFLFRDGDILGKYVD,10793.83041469,10800.49928,,,,,1
12585,CH10_HUMAN,P61604,10 kDa heat shock protein; mitochondrial,P61604,,MAGQAFRKFLPLFDRVLVERSAAETVTKGGIMLPEKSQGKVLQATVVAVGSGSKGKGGEIQPVSVKVGDKVLLPEYGGTKVVLDDKDYFLFRDGDILGKYVD,1,101,101,AGQAFRKFLPLFDRVLVERSAAETVTKGGIMLPEKSQGKVLQATVVAVGSGSKGKGGEIQPVSVKVGDKVLLPEYGGTKVVLDDKDYFLFRDGDILGKYVD,10957.81787569,10964.55928,,RESID:41@0|RESID:38@77|RESID:55@84,,,1
12883,CH10_HUMAN,P61604,10 kDa heat shock protein; mitochondrial,P61604,,MAGQAFRKFLPLFDRVLVERSAAETVTKGGIMLPEKSQGKVLQATVVAVGSGSKGKGGEIQPVSVKVGDKVLLPEYGGTKVVLDDKDYFLFRDGDILGKYVD,0,101,102,MAGQAFRKFLPLFDRVLVERSAAETVTKGGIMLPEKSQGKVLQATVVAVGSGSKGKGGEIQPVSVKVGDKVLLPEYGGTKVVLDDKDYFLFRDGDILGKYVD,11046.84780069,11053.71188,,RESID:55@55|RESID:38@78,,,1
12884,CH10_HUMAN,P61604,10 kDa heat shock protein; mitochondrial,P61604,,MAGQAFRKFLPLFDRVLVERSAAETVTKGGIMLPEKSQGKVLQATVVAVGSGSKGKGGEIQPVSVKVGDKVLLPEYGGTKVVLDDKDYFLFRDGDILGKYVD,0,101,102,MAGQAFRKFLPLFDRVLVERSAAETVTKGGIMLPEKSQGKVLQATVVAVGSGSKGKGGEIQPVSVKVGDKVLLPEYGGTKVVLDDKDYFLFRDGDILGKYVD,11046.84780069,11053.71188,,RESID:49@0|RESID:38@78,,,1
13359,CH10_HUMAN,P61604,10 kDa heat shock protein; mitochondrial,P61604,,MAGQAFRKFLPLFDRVLVERSAAETVTKGGIMLPEKSQGKVLQATVVAVGSGSKGKGGEIQPVSVKVGDKVLLPEYGGTKVVLDDKDYFLFRDGDILGKYVD,1,101,101,AGQAFRKFLPLFDRVLVERSAAETVTKGGIMLPEKSQGKVLQATVVAVGSGSKGKGGEIQPVSVKVGDKVLLPEYGGTKVVLDDKDYFLFRDGDILGKYVD,10919.86210969,10926.61928,,RESID:41@0|RESID:55@54|RESID:55@84,,,1
13552,CH10_HUMAN,P61604,10 kDa heat shock protein; mitochondrial,P61604,,MAGQAFRKFLPLFDRVLVERSAAETVTKGGIMLPEKSQGKVLQATVVAVGSGSKGKGGEIQPVSVKVGDKVLLPEYGGTKVVLDDKDYFLFRDGDILGKYVD,1,101,101,AGQAFRKFLPLFDRVLVERSAAETVTKGGIMLPEKSQGKVLQATVVAVGSGSKGKGGEIQPVSVKVGDKVLLPEYGGTKVVLDDKDYFLFRDGDILGKYVD,10877.85154469,10884.57928,,RESID:41@0|RESID:55@97,,,1
13660,CH10_HUMAN,P61604,10 kDa heat shock protein; mitochondrial,P61604,,MAGQAFRKFLPLFDRVLVERSAAETVTKGGIMLPEKSQGKVLQATVVAVGSGSKGKGGEIQPVSVKVGDKVLLPEYGGTKVVLDDKDYFLFRDGDILGKYVD,1,101,101,AGQAFRKFLPLFDRVLVERSAAETVTKGGIMLPEKSQGKVLQATVVAVGSGSKGKGGEIQPVSVKVGDKVLLPEYGGTKVVLDDKDYFLFRDGDILGKYVD,10873.79674569,10880.47928,,RESID:38@77,,,1
14787,CH10_HUMAN,P61604,10 kDa heat shock protein; mitochondrial,P61604,,MAGQAFRKFLPLFDRVLVERSAAETVTKGGIMLPEKSQGKVLQATVVAVGSGSKGKGGEIQPVSVKVGDKVLLPEYGGTKVVLDDKDYFLFRDGDILGKYVD,1,101,101,AGQAFRKFLPLFDRVLVERSAAETVTKGGIMLPEKSQGKVLQATVVAVGSGSKGKGGEIQPVSVKVGDKVLLPEYGGTKVVLDDKDYFLFRDGDILGKYVD,10999.82844069,11006.59928,,RESID:41@0|RESID:55@54|RESID:38@77|RESID:55@84,,,1
15877,CH10_HUMAN,P61604,10 kDa heat shock protein; mitochondrial,P61604,,MAGQAFRKFLPLFDRVLVERSAAETVTKGGIMLPEKSQGKVLQATVVAVGSGSKGKGGEIQPVSVKVGDKVLLPEYGGTKVVLDDKDYFLFRDGDILGKYVD,1,101,101,AGQAFRKFLPLFDRVLVERSAAETVTKGGIMLPEKSQGKVLQATVVAVGSGSKGKGGEIQPVSVKVGDKVLLPEYGGTKVVLDDKDYFLFRDGDILGKYVD,10835.84098,10842.53928,,,PSI-MOD:1458,,0
15880,CH10_HUMAN,P61604,10 kDa heat shock protein; mitochondrial,P61604,,MAGQAFRKFLPLFDRVLVERSAAETVTKGGIMLPEKSQGKVLQATVVAVGSGSKGKGGEIQPVSVKVGDKVLLPEYGGTKVVLDDKDYFLFRDGDILGKYVD,1,101,101,AGQAFRKFLPLFDRVLVERSAAETVTKGGIMLPEKSQGKVLQATVVAVGSGSKGKGGEIQPVSVKVGDKVLLPEYGGTKVVLDDKDYFLFRDGDILGKYVD,10835.84098,10842.53928,,RESID:55@6,,,0
16242,CH10_HUMAN,P61604,10 kDa heat shock protein; mitochondrial,P61604,,MAGQAFRKFLPLFDRVLVERSAAETVTKGGIMLPEKSQGKVLQATVVAVGSGSKGKGGEIQPVSVKVGDKVLLPEYGGTKVVLDDKDYFLFRDGDILGKYVD,1,101,101,AGQAFRKFLPLFDRVLVERSAAETVTKGGIMLPEKSQGKVLQATVVAVGSGSKGKGGEIQPVSVKVGDKVLLPEYGGTKVVLDDKDYFLFRDGDILGKYVD,10935.85702,10942.60928,,RESID:55@6|RESID:545@26,,,0
16255,CH10_HUMAN,P61604,10 kDa heat shock protein; mitochondrial,P61604,,MAGQAFRKFLPLFDRVLVERSAAETVTKGGIMLPEKSQGKVLQATVVAVGSGSKGKGGEIQPVSVKVGDKVLLPEYGGTKVVLDDKDYFLFRDGDILGKYVD,0,101,102,MAGQAFRKFLPLFDRVLVERSAAETVTKGGIMLPEKSQGKVLQATVVAVGSGSKGKGGEIQPVSVKVGDKVLLPEYGGTKVVLDDKDYFLFRDGDILGKYVD,10966.88147,10973.73188,,RESID:55@7,,,0
16408,CH10_HUMAN,P61604,10 kDa heat shock protein; mitochondrial,P61604,,MAGQAFRKFLPLFDRVLVERSAAETVTKGGIMLPEKSQGKVLQATVVAVGSGSKGKGGEIQPVSVKVGDKVLLPEYGGTKVVLDDKDYFLFRDGDILGKYVD,28,101,74,GGIMLPEKSQGKVLQATVVAVGSGSKGKGGEIQPVSVKVGDKVLLPEYGGTKVVLDDKDYFLFRDGDILGKYVD,7763.153775,7767.96028,,,,,0
16718,CH10_HUMAN,P61604,10 kDa heat shock protein; mitochondrial,P61604,,MAGQAFRKFLPLFDRVLVERSAAETVTKGGIMLPEKSQGKVLQATVVAVGSGSKGKGGEIQPVSVKVGDKVLLPEYGGTKVVLDDKDYFLFRDGDILGKYVD,1,101,101,AGQAFRKFLPLFDRVLVERSAAETVTKGGIMLPEKSQGKVLQATVVAVGSGSKGKGGEIQPVSVKVGDKVLLPEYGGTKVVLDDKDYFLFRDGDILGKYVD,10893.84646,10900.56928,,RESID:545@26,,,0
17146,CH10_HUMAN,P61604,10 kDa heat shock protein; mitochondrial,P61604,,MAGQAFRKFLPLFDRVLVERSAAETVTKGGIMLPEKSQGKVLQATVVAVGSGSKGKGGEIQPVSVKVGDKVLLPEYGGTKVVLDDKDYFLFRDGDILGKYVD,1,101,101,AGQAFRKFLPLFDRVLVERSAAETVTKGGIMLPEKSQGKVLQATVVAVGSGSKGKGGEIQPVSVKVGDKVLLPEYGGTKVVLDDKDYFLFRDGDILGKYVD,11099.84448,11106.66928,,RESID:545@64|RESID:55@68|RESID:38@77|RESID:55@78,PSI-MOD:1458,,0
17212,CH10_HUMAN,P61604,10 kDa heat shock protein; mitochondrial,P61604,,MAGQAFRKFLPLFDRVLVERSAAETVTKGGIMLPEKSQGKVLQATVVAVGSGSKGKGGEIQPVSVKVGDKVLLPEYGGTKVVLDDKDYFLFRDGDILGKYVD,0,101,102,MAGQAFRKFLPLFDRVLVERSAAETVTKGGIMLPEKSQGKVLQATVVAVGSGSKGKGGEIQPVSVKVGDKVLLPEYGGTKVVLDDKDYFLFRDGDILGKYVD,11108.90808,11115.84188,,RESID:55@7|RESID:545@27,PSI-MOD:1458,,0
21865,CH10_HUMAN,P61604,10 kDa heat shock protein; mitochondrial,P61604,,MAGQAFRKFLPLFDRVLVERSAAETVTKGGIMLPEKSQGKVLQATVVAVGSGSKGKGGEIQPVSVKVGDKVLLPEYGGTKVVLDDKDYFLFRDGDILGKYVD,0,101,102,MAGQAFRKFLPLFDRVLVERSAAETVTKGGIMLPEKSQGKVLQATVVAVGSGSKGKGGEIQPVSVKVGDKVLLPEYGGTKVVLDDKDYFLFRDGDILGKYVD,11366.94564569,11374.01188,,RESID:545@27|RESID:545@65|RESID:545@69|RESID:545@79,PSI-MOD:1458,,1
