PFR,UniProt Id,Entry Accession,Entry Description,Isoform Accession,Isoform Description,Isoform Sequence,Start,End,Length,Proteoform Sequence,Monoisotopic Mass,Average Mass,Sequence Modifications,PTMs,N-Terminal,C-Terminal,Star
3904,RL7A_HUMAN,P62424,60S ribosomal protein L7a,P62424,,MPKGKKAKGKKVAPAPAVVKKQEAKKVVNPLFEKRPKNFGIGQDIQPKRDLTRFVKWPRYIRLQRQRAILYKRLKVPPAINQFTQALDRQTATQLLKLAHKYRPETKQEKKQRLLARAEKKAAGKGDVPTKRPPVLRAGVNTVTTLVENKKAQLVVIAHDVDPIELVVFLPALCRKMGVPYCIIKGKARLGRLVHRKTCTTVAFTQVNSEDKGALAKLVEAIRTNYNDRYDEIRRHWGGNVLGPKSVARIAKLEKAKAKELATKLG,1,265,265,PKGKKAKGKKVAPAPAVVKKQEAKKVVNPLFEKRPKNFGIGQDIQPKRDLTRFVKWPRYIRLQRQRAILYKRLKVPPAINQFTQALDRQTATQLLKLAHKYRPETKQEKKQRLLARAEKKAAGKGDVPTKRPPVLRAGVNTVTTLVENKKAQLVVIAHDVDPIELVVFLPALCRKMGVPYCIIKGKARLGRLVHRKTCTTVAFTQVNSEDKGALAKLVEAIRTNYNDRYDEIRRHWGGNVLGPKSVARIAKLEKAKAKELATKLG,29845.98296469,29864.43168,,,,,1
14221,RL7A_HUMAN,P62424,60S ribosomal protein L7a,P62424,,MPKGKKAKGKKVAPAPAVVKKQEAKKVVNPLFEKRPKNFGIGQDIQPKRDLTRFVKWPRYIRLQRQRAILYKRLKVPPAINQFTQALDRQTATQLLKLAHKYRPETKQEKKQRLLARAEKKAAGKGDVPTKRPPVLRAGVNTVTTLVENKKAQLVVIAHDVDPIELVVFLPALCRKMGVPYCIIKGKARLGRLVHRKTCTTVAFTQVNSEDKGALAKLVEAIRTNYNDRYDEIRRHWGGNVLGPKSVARIAKLEKAKAKELATKLG,1,265,265,PKGKKAKGKKVAPAPAVVKKQEAKKVVNPLFEKRPKNFGIGQDIQPKRDLTRFVKWPRYIRLQRQRAILYKRLKVPPAINQFTQALDRQTATQLLKLAHKYRPETKQEKKQRLLARAEKKAAGKGDVPTKRPPVLRAGVNTVTTLVENKKAQLVVIAHDVDPIELVVFLPALCRKMGVPYCIIKGKARLGRLVHRKTCTTVAFTQVNSEDKGALAKLVEAIRTNYNDRYDEIRRHWGGNVLGPKSVARIAKLEKAKAKELATKLG,29972.01465969,29990.55168,,RESID:55@32|RESID:55@95|RESID:55@215,,,1
14520,RL7A_HUMAN,P62424,60S ribosomal protein L7a,P62424,,MPKGKKAKGKKVAPAPAVVKKQEAKKVVNPLFEKRPKNFGIGQDIQPKRDLTRFVKWPRYIRLQRQRAILYKRLKVPPAINQFTQALDRQTATQLLKLAHKYRPETKQEKKQRLLARAEKKAAGKGDVPTKRPPVLRAGVNTVTTLVENKKAQLVVIAHDVDPIELVVFLPALCRKMGVPYCIIKGKARLGRLVHRKTCTTVAFTQVNSEDKGALAKLVEAIRTNYNDRYDEIRRHWGGNVLGPKSVARIAKLEKAKAKELATKLG,1,265,265,PKGKKAKGKKVAPAPAVVKKQEAKKVVNPLFEKRPKNFGIGQDIQPKRDLTRFVKWPRYIRLQRQRAILYKRLKVPPAINQFTQALDRQTATQLLKLAHKYRPETKQEKKQRLLARAEKKAAGKGDVPTKRPPVLRAGVNTVTTLVENKKAQLVVIAHDVDPIELVVFLPALCRKMGVPYCIIKGKARLGRLVHRKTCTTVAFTQVNSEDKGALAKLVEAIRTNYNDRYDEIRRHWGGNVLGPKSVARIAKLEKAKAKELATKLG,29887.99352969,29906.47168,,RESID:55@32,,,1
14689,RL7A_HUMAN,P62424,60S ribosomal protein L7a,P62424,,MPKGKKAKGKKVAPAPAVVKKQEAKKVVNPLFEKRPKNFGIGQDIQPKRDLTRFVKWPRYIRLQRQRAILYKRLKVPPAINQFTQALDRQTATQLLKLAHKYRPETKQEKKQRLLARAEKKAAGKGDVPTKRPPVLRAGVNTVTTLVENKKAQLVVIAHDVDPIELVVFLPALCRKMGVPYCIIKGKARLGRLVHRKTCTTVAFTQVNSEDKGALAKLVEAIRTNYNDRYDEIRRHWGGNVLGPKSVARIAKLEKAKAKELATKLG,1,265,265,PKGKKAKGKKVAPAPAVVKKQEAKKVVNPLFEKRPKNFGIGQDIQPKRDLTRFVKWPRYIRLQRQRAILYKRLKVPPAINQFTQALDRQTATQLLKLAHKYRPETKQEKKQRLLARAEKKAAGKGDVPTKRPPVLRAGVNTVTTLVENKKAQLVVIAHDVDPIELVVFLPALCRKMGVPYCIIKGKARLGRLVHRKTCTTVAFTQVNSEDKGALAKLVEAIRTNYNDRYDEIRRHWGGNVLGPKSVARIAKLEKAKAKELATKLG,29887.99352969,29906.47168,,RESID:55@95,,,1
14690,RL7A_HUMAN,P62424,60S ribosomal protein L7a,P62424,,MPKGKKAKGKKVAPAPAVVKKQEAKKVVNPLFEKRPKNFGIGQDIQPKRDLTRFVKWPRYIRLQRQRAILYKRLKVPPAINQFTQALDRQTATQLLKLAHKYRPETKQEKKQRLLARAEKKAAGKGDVPTKRPPVLRAGVNTVTTLVENKKAQLVVIAHDVDPIELVVFLPALCRKMGVPYCIIKGKARLGRLVHRKTCTTVAFTQVNSEDKGALAKLVEAIRTNYNDRYDEIRRHWGGNVLGPKSVARIAKLEKAKAKELATKLG,1,265,265,PKGKKAKGKKVAPAPAVVKKQEAKKVVNPLFEKRPKNFGIGQDIQPKRDLTRFVKWPRYIRLQRQRAILYKRLKVPPAINQFTQALDRQTATQLLKLAHKYRPETKQEKKQRLLARAEKKAAGKGDVPTKRPPVLRAGVNTVTTLVENKKAQLVVIAHDVDPIELVVFLPALCRKMGVPYCIIKGKARLGRLVHRKTCTTVAFTQVNSEDKGALAKLVEAIRTNYNDRYDEIRRHWGGNVLGPKSVARIAKLEKAKAKELATKLG,29930.00409469,29948.51168,,RESID:55@32|RESID:55@95,,,1
17186,RL7A_HUMAN,P62424,60S ribosomal protein L7a,P62424,,MPKGKKAKGKKVAPAPAVVKKQEAKKVVNPLFEKRPKNFGIGQDIQPKRDLTRFVKWPRYIRLQRQRAILYKRLKVPPAINQFTQALDRQTATQLLKLAHKYRPETKQEKKQRLLARAEKKAAGKGDVPTKRPPVLRAGVNTVTTLVENKKAQLVVIAHDVDPIELVVFLPALCRKMGVPYCIIKGKARLGRLVHRKTCTTVAFTQVNSEDKGALAKLVEAIRTNYNDRYDEIRRHWGGNVLGPKSVARIAKLEKAKAKELATKLG,1,47,47,PKGKKAKGKKVAPAPAVVKKQEAKKVVNPLFEKRPKNFGIGQDIQPK,5119.038875,5122.18158,,,,,0
18069,RL7A_HUMAN,P62424,60S ribosomal protein L7a,P62424,,MPKGKKAKGKKVAPAPAVVKKQEAKKVVNPLFEKRPKNFGIGQDIQPKRDLTRFVKWPRYIRLQRQRAILYKRLKVPPAINQFTQALDRQTATQLLKLAHKYRPETKQEKKQRLLARAEKKAAGKGDVPTKRPPVLRAGVNTVTTLVENKKAQLVVIAHDVDPIELVVFLPALCRKMGVPYCIIKGKARLGRLVHRKTCTTVAFTQVNSEDKGALAKLVEAIRTNYNDRYDEIRRHWGGNVLGPKSVARIAKLEKAKAKELATKLG,1,51,51,PKGKKAKGKKVAPAPAVVKKQEAKKVVNPLFEKRPKNFGIGQDIQPKRDLT,5604.298665,5607.72218,,,,,0
18245,RL7A_HUMAN,P62424,60S ribosomal protein L7a,P62424,,MPKGKKAKGKKVAPAPAVVKKQEAKKVVNPLFEKRPKNFGIGQDIQPKRDLTRFVKWPRYIRLQRQRAILYKRLKVPPAINQFTQALDRQTATQLLKLAHKYRPETKQEKKQRLLARAEKKAAGKGDVPTKRPPVLRAGVNTVTTLVENKKAQLVVIAHDVDPIELVVFLPALCRKMGVPYCIIKGKARLGRLVHRKTCTTVAFTQVNSEDKGALAKLVEAIRTNYNDRYDEIRRHWGGNVLGPKSVARIAKLEKAKAKELATKLG,1,30,30,PKGKKAKGKKVAPAPAVVKKQEAKKVVNPL,3135.969885,3137.89328,,,,,0
