PFR,UniProt Id,Entry Accession,Entry Description,Isoform Accession,Isoform Description,Isoform Sequence,Start,End,Length,Proteoform Sequence,Monoisotopic Mass,Average Mass,Sequence Modifications,PTMs,N-Terminal,C-Terminal,Star
7990,RL23A_HUMAN,P62750,60S ribosomal protein L23a,P62750,,MAPKAKKEAPAPPKAEAKAKALKAKKAVLKGVHSHKKKKIRTSPTFRRPKTLRLRRQPKYPRKSAPRRNKLDHYAIIKFPLTTESAMKKIEDNNTLVFIVDVKANKHQIKQAVKKLYDIDVAKVNTLIRPDGEKKAYVRLAPDYDALDVANKIGII,1,155,155,APKAKKEAPAPPKAEAKAKALKAKKAVLKGVHSHKKKKIRTSPTFRRPKTLRLRRQPKYPRKSAPRRNKLDHYAIIKFPLTTESAMKKIEDNNTLVFIVDVKANKHQIKQAVKKLYDIDVAKVNTLIRPDGEKKAYVRLAPDYDALDVANKIGII,17595.10387969,17605.91078,,RESID:41@0,,,1
7991,RL23A_HUMAN,P62750,60S ribosomal protein L23a,P62750,,MAPKAKKEAPAPPKAEAKAKALKAKKAVLKGVHSHKKKKIRTSPTFRRPKTLRLRRQPKYPRKSAPRRNKLDHYAIIKFPLTTESAMKKIEDNNTLVFIVDVKANKHQIKQAVKKLYDIDVAKVNTLIRPDGEKKAYVRLAPDYDALDVANKIGII,1,155,155,APKAKKEAPAPPKAEAKAKALKAKKAVLKGVHSHKKKKIRTSPTFRRPKTLRLRRQPKYPRKSAPRRNKLDHYAIIKFPLTTESAMKKIEDNNTLVFIVDVKANKHQIKQAVKKLYDIDVAKVNTLIRPDGEKKAYVRLAPDYDALDVANKIGII,17675.10659631,17685.93350362,,RESID:62@0|RESID:37@41,,,1
7992,RL23A_HUMAN,P62750,60S ribosomal protein L23a,P62750,,MAPKAKKEAPAPPKAEAKAKALKAKKAVLKGVHSHKKKKIRTSPTFRRPKTLRLRRQPKYPRKSAPRRNKLDHYAIIKFPLTTESAMKKIEDNNTLVFIVDVKANKHQIKQAVKKLYDIDVAKVNTLIRPDGEKKAYVRLAPDYDALDVANKIGII,0,155,156,MAPKAKKEAPAPPKAEAKAKALKAKKAVLKGVHSHKKKKIRTSPTFRRPKTLRLRRQPKYPRKSAPRRNKLDHYAIIKFPLTTESAMKKIEDNNTLVFIVDVKANKHQIKQAVKKLYDIDVAKVNTLIRPDGEKKAYVRLAPDYDALDVANKIGII,17684.13380469,17695.06338,,,,,1
13998,RL23A_HUMAN,P62750,60S ribosomal protein L23a,P62750,,MAPKAKKEAPAPPKAEAKAKALKAKKAVLKGVHSHKKKKIRTSPTFRRPKTLRLRRQPKYPRKSAPRRNKLDHYAIIKFPLTTESAMKKIEDNNTLVFIVDVKANKHQIKQAVKKLYDIDVAKVNTLIRPDGEKKAYVRLAPDYDALDVANKIGII,1,155,155,APKAKKEAPAPPKAEAKAKALKAKKAVLKGVHSHKKKKIRTSPTFRRPKTLRLRRQPKYPRKSAPRRNKLDHYAIIKFPLTTESAMKKIEDNNTLVFIVDVKANKHQIKQAVKKLYDIDVAKVNTLIRPDGEKKAYVRLAPDYDALDVANKIGII,17675.07021069,17685.89078,,RESID:41@0|RESID:38@43,,,1
14338,RL23A_HUMAN,P62750,60S ribosomal protein L23a,P62750,,MAPKAKKEAPAPPKAEAKAKALKAKKAVLKGVHSHKKKKIRTSPTFRRPKTLRLRRQPKYPRKSAPRRNKLDHYAIIKFPLTTESAMKKIEDNNTLVFIVDVKANKHQIKQAVKKLYDIDVAKVNTLIRPDGEKKAYVRLAPDYDALDVANKIGII,1,155,155,APKAKKEAPAPPKAEAKAKALKAKKAVLKGVHSHKKKKIRTSPTFRRPKTLRLRRQPKYPRKSAPRRNKLDHYAIIKFPLTTESAMKKIEDNNTLVFIVDVKANKHQIKQAVKKLYDIDVAKVNTLIRPDGEKKAYVRLAPDYDALDVANKIGII,17553.09331469,17563.87078,,,,,1
14339,RL23A_HUMAN,P62750,60S ribosomal protein L23a,P62750,,MAPKAKKEAPAPPKAEAKAKALKAKKAVLKGVHSHKKKKIRTSPTFRRPKTLRLRRQPKYPRKSAPRRNKLDHYAIIKFPLTTESAMKKIEDNNTLVFIVDVKANKHQIKQAVKKLYDIDVAKVNTLIRPDGEKKAYVRLAPDYDALDVANKIGII,0,155,156,MAPKAKKEAPAPPKAEAKAKALKAKKAVLKGVHSHKKKKIRTSPTFRRPKTLRLRRQPKYPRKSAPRRNKLDHYAIIKFPLTTESAMKKIEDNNTLVFIVDVKANKHQIKQAVKKLYDIDVAKVNTLIRPDGEKKAYVRLAPDYDALDVANKIGII,17726.14436969,17737.10338,,RESID:49@0,,,1
16022,RL23A_HUMAN,P62750,60S ribosomal protein L23a,P62750,,MAPKAKKEAPAPPKAEAKAKALKAKKAVLKGVHSHKKKKIRTSPTFRRPKTLRLRRQPKYPRKSAPRRNKLDHYAIIKFPLTTESAMKKIEDNNTLVFIVDVKANKHQIKQAVKKLYDIDVAKVNTLIRPDGEKKAYVRLAPDYDALDVANKIGII,1,155,155,APKAKKEAPAPPKAEAKAKALKAKKAVLKGVHSHKKKKIRTSPTFRRPKTLRLRRQPKYPRKSAPRRNKLDHYAIIKFPLTTESAMKKIEDNNTLVFIVDVKANKHQIKQAVKKLYDIDVAKVNTLIRPDGEKKAYVRLAPDYDALDVANKIGII,17595.14027,17605.9535,,RESID:62@0,,,0
16372,RL23A_HUMAN,P62750,60S ribosomal protein L23a,P62750,,MAPKAKKEAPAPPKAEAKAKALKAKKAVLKGVHSHKKKKIRTSPTFRRPKTLRLRRQPKYPRKSAPRRNKLDHYAIIKFPLTTESAMKKIEDNNTLVFIVDVKANKHQIKQAVKKLYDIDVAKVNTLIRPDGEKKAYVRLAPDYDALDVANKIGII,1,155,155,APKAKKEAPAPPKAEAKAKALKAKKAVLKGVHSHKKKKIRTSPTFRRPKTLRLRRQPKYPRKSAPRRNKLDHYAIIKFPLTTESAMKKIEDNNTLVFIVDVKANKHQIKQAVKKLYDIDVAKVNTLIRPDGEKKAYVRLAPDYDALDVANKIGII,17596.12428,17606.9335,,RESID:62@0|RESID:214@39,,,0
