PFR,UniProt Id,Entry Accession,Entry Description,Isoform Accession,Isoform Description,Isoform Sequence,Start,End,Length,Proteoform Sequence,Monoisotopic Mass,Average Mass,Sequence Modifications,PTMs,N-Terminal,C-Terminal,Star
3426,RL31_HUMAN,P62899,60S ribosomal protein L31,P62899-1,1,MAPAKKGGEKKKGRSAINEVVTREYTINIHKRIHGVGFKKRAPRALKEIRKFAMKEMGTPDVRIDTRLNKAVWAKGIRNVPYRIRVRLSRKRNEDEDSPNKLYTLVTYVPVTTFKNLQTVNVDEN,1,124,124,APAKKGGEKKKGRSAINEVVTREYTINIHKRIHGVGFKKRAPRALKEIRKFAMKEMGTPDVRIDTRLNKAVWAKGIRNVPYRIRVRLSRKRNEDEDSPNKLYTLVTYVPVTTFKNLQTVNVDEN,14402.85545569,14411.64938,,RESID:37@13,,,1
3765,RL31_HUMAN,P62899,60S ribosomal protein L31,P62899-1,1,MAPAKKGGEKKKGRSAINEVVTREYTINIHKRIHGVGFKKRAPRALKEIRKFAMKEMGTPDVRIDTRLNKAVWAKGIRNVPYRIRVRLSRKRNEDEDSPNKLYTLVTYVPVTTFKNLQTVNVDEN,0,124,125,MAPAKKGGEKKKGRSAINEVVTREYTINIHKRIHGVGFKKRAPRALKEIRKFAMKEMGTPDVRIDTRLNKAVWAKGIRNVPYRIRVRLSRKRNEDEDSPNKLYTLVTYVPVTTFKNLQTVNVDEN,14575.90651069,14584.88198,,RESID:49@0|RESID:37@14,,,1
4011,RL31_HUMAN,P62899,60S ribosomal protein L31,P62899-1,1,MAPAKKGGEKKKGRSAINEVVTREYTINIHKRIHGVGFKKRAPRALKEIRKFAMKEMGTPDVRIDTRLNKAVWAKGIRNVPYRIRVRLSRKRNEDEDSPNKLYTLVTYVPVTTFKNLQTVNVDEN,0,124,125,MAPAKKGGEKKKGRSAINEVVTREYTINIHKRIHGVGFKKRAPRALKEIRKFAMKEMGTPDVRIDTRLNKAVWAKGIRNVPYRIRVRLSRKRNEDEDSPNKLYTLVTYVPVTTFKNLQTVNVDEN,14693.82860769,14702.80198,,RESID:37@14|RESID:37@97|RESID:39@102,,,1
5524,RL31_HUMAN,P62899,60S ribosomal protein L31,P62899-1,1,MAPAKKGGEKKKGRSAINEVVTREYTINIHKRIHGVGFKKRAPRALKEIRKFAMKEMGTPDVRIDTRLNKAVWAKGIRNVPYRIRVRLSRKRNEDEDSPNKLYTLVTYVPVTTFKNLQTVNVDEN,1,124,124,APAKKGGEKKKGRSAINEVVTREYTINIHKRIHGVGFKKRAPRALKEIRKFAMKEMGTPDVRIDTRLNKAVWAKGIRNVPYRIRVRLSRKRNEDEDSPNKLYTLVTYVPVTTFKNLQTVNVDEN,14322.88912469,14331.66938,,,,,1
13266,RL31_HUMAN,P62899,60S ribosomal protein L31,P62899-1,1,MAPAKKGGEKKKGRSAINEVVTREYTINIHKRIHGVGFKKRAPRALKEIRKFAMKEMGTPDVRIDTRLNKAVWAKGIRNVPYRIRVRLSRKRNEDEDSPNKLYTLVTYVPVTTFKNLQTVNVDEN,0,124,125,MAPAKKGGEKKKGRSAINEVVTREYTINIHKRIHGVGFKKRAPRALKEIRKFAMKEMGTPDVRIDTRLNKAVWAKGIRNVPYRIRVRLSRKRNEDEDSPNKLYTLVTYVPVTTFKNLQTVNVDEN,14495.94017969,14504.90198,,RESID:49@0,,,1
16758,RL31_HUMAN,P62899,60S ribosomal protein L31,P62899-1,1,MAPAKKGGEKKKGRSAINEVVTREYTINIHKRIHGVGFKKRAPRALKEIRKFAMKEMGTPDVRIDTRLNKAVWAKGIRNVPYRIRVRLSRKRNEDEDSPNKLYTLVTYVPVTTFKNLQTVNVDEN,3,124,122,AKKGGEKKKGRSAINEVVTREYTINIHKRIHGVGFKKRAPRALKEIRKFAMKEMGTPDVRIDTRLNKAVWAKGIRNVPYRIRVRLSRKRNEDEDSPNKLYTLVTYVPVTTFKNLQTVNVDEN,14154.79925,14163.47388,,,,,0
73114,RL31_HUMAN,P62899,60S ribosomal protein L31,P62899-1,1,MAPAKKGGEKKKGRSAINEVVTREYTINIHKRIHGVGFKKRAPRALKEIRKFAMKEMGTPDVRIDTRLNKAVWAKGIRNVPYRIRVRLSRKRNEDEDSPNKLYTLVTYVPVTTFKNLQTVNVDEN,62,124,63,RIDTRLNKAVWAKGIRNVPYRIRVRLSRKRNEDEDSPNKLYTLVTYVPVTTFKNLQTVNVDEN,7471.05043469,7475.54438,,,,,1
73433,RL31_HUMAN,P62899,60S ribosomal protein L31,P62899-1,1,MAPAKKGGEKKKGRSAINEVVTREYTINIHKRIHGVGFKKRAPRALKEIRKFAMKEMGTPDVRIDTRLNKAVWAKGIRNVPYRIRVRLSRKRNEDEDSPNKLYTLVTYVPVTTFKNLQTVNVDEN,66,124,59,RLNKAVWAKGIRNVPYRIRVRLSRKRNEDEDSPNKLYTLVTYVPVTTFKNLQTVNVDEN,6985.79064469,6990.00378,,,,,1
