PFR,UniProt Id,Entry Accession,Entry Description,Isoform Accession,Isoform Description,Isoform Sequence,Start,End,Length,Proteoform Sequence,Monoisotopic Mass,Average Mass,Sequence Modifications,PTMs,N-Terminal,C-Terminal,Star
9131,H2B1A_MOUSE,P70696,Histone H2B type 1-A,P70696,,MPEVAVKGATISKKGFKKAVTKTQKKEGRKRKRCRKESYSIYIYKVLKQVHPDTGISSKAMSIMNSFVTDIFERIASEASRLAHYNKRSTITSREIQTAVRLLLPGELAKHAVSEGTKAVTKYTSSK,0,126,127,MPEVAVKGATISKKGFKKAVTKTQKKEGRKRKRCRKESYSIYIYKVLKQVHPDTGISSKAMSIMNSFVTDIFERIASEASRLAHYNKRSTITSREIQTAVRLLLPGELAKHAVSEGTKAVTKYTSSK,14437.80782969,14446.82488,,RESID:55@6|RESID:55@12|RESID:55@16|RESID:55@21|RESID:55@24,,,1
9991,H2B1A_MOUSE,P70696,Histone H2B type 1-A,P70696,,MPEVAVKGATISKKGFKKAVTKTQKKEGRKRKRCRKESYSIYIYKVLKQVHPDTGISSKAMSIMNSFVTDIFERIASEASRLAHYNKRSTITSREIQTAVRLLLPGELAKHAVSEGTKAVTKYTSSK,0,126,127,MPEVAVKGATISKKGFKKAVTKTQKKEGRKRKRCRKESYSIYIYKVLKQVHPDTGISSKAMSIMNSFVTDIFERIASEASRLAHYNKRSTITSREIQTAVRLLLPGELAKHAVSEGTKAVTKYTSSK,14563.83952469,14572.94488,,RESID:49@0|RESID:55@6|RESID:55@12|RESID:55@13|RESID:55@16|RESID:55@17|RESID:55@21|RESID:55@24,,,1
10009,H2B1A_MOUSE,P70696,Histone H2B type 1-A,P70696,,MPEVAVKGATISKKGFKKAVTKTQKKEGRKRKRCRKESYSIYIYKVLKQVHPDTGISSKAMSIMNSFVTDIFERIASEASRLAHYNKRSTITSREIQTAVRLLLPGELAKHAVSEGTKAVTKYTSSK,0,126,127,MPEVAVKGATISKKGFKKAVTKTQKKEGRKRKRCRKESYSIYIYKVLKQVHPDTGISSKAMSIMNSFVTDIFERIASEASRLAHYNKRSTITSREIQTAVRLLLPGELAKHAVSEGTKAVTKYTSSK,14269.76556969,14278.66488,,RESID:49@0,,,1
10077,H2B1A_MOUSE,P70696,Histone H2B type 1-A,P70696,,MPEVAVKGATISKKGFKKAVTKTQKKEGRKRKRCRKESYSIYIYKVLKQVHPDTGISSKAMSIMNSFVTDIFERIASEASRLAHYNKRSTITSREIQTAVRLLLPGELAKHAVSEGTKAVTKYTSSK,0,126,127,MPEVAVKGATISKKGFKKAVTKTQKKEGRKRKRCRKESYSIYIYKVLKQVHPDTGISSKAMSIMNSFVTDIFERIASEASRLAHYNKRSTITSREIQTAVRLLLPGELAKHAVSEGTKAVTKYTSSK,14395.79726469,14404.78488,,RESID:55@6|RESID:55@16|RESID:55@17|RESID:55@21,,,1
10189,H2B1A_MOUSE,P70696,Histone H2B type 1-A,P70696,,MPEVAVKGATISKKGFKKAVTKTQKKEGRKRKRCRKESYSIYIYKVLKQVHPDTGISSKAMSIMNSFVTDIFERIASEASRLAHYNKRSTITSREIQTAVRLLLPGELAKHAVSEGTKAVTKYTSSK,0,126,127,MPEVAVKGATISKKGFKKAVTKTQKKEGRKRKRCRKESYSIYIYKVLKQVHPDTGISSKAMSIMNSFVTDIFERIASEASRLAHYNKRSTITSREIQTAVRLLLPGELAKHAVSEGTKAVTKYTSSK,14437.80782969,14446.82488,,RESID:55@6|RESID:55@12|RESID:55@16|RESID:55@17|RESID:55@21,,,1
10444,H2B1A_MOUSE,P70696,Histone H2B type 1-A,P70696,,MPEVAVKGATISKKGFKKAVTKTQKKEGRKRKRCRKESYSIYIYKVLKQVHPDTGISSKAMSIMNSFVTDIFERIASEASRLAHYNKRSTITSREIQTAVRLLLPGELAKHAVSEGTKAVTKYTSSK,1,126,126,PEVAVKGATISKKGFKKAVTKTQKKEGRKRKRCRKESYSIYIYKVLKQVHPDTGISSKAMSIMNSFVTDIFERIASEASRLAHYNKRSTITSREIQTAVRLLLPGELAKHAVSEGTKAVTKYTSSK,14390.78846969,14399.71228,,RESID:50@0|RESID:55@5|RESID:55@12|RESID:55@15|RESID:55@20|RESID:55@23|RESID:55@108,,,1
10453,H2B1A_MOUSE,P70696,Histone H2B type 1-A,P70696,,MPEVAVKGATISKKGFKKAVTKTQKKEGRKRKRCRKESYSIYIYKVLKQVHPDTGISSKAMSIMNSFVTDIFERIASEASRLAHYNKRSTITSREIQTAVRLLLPGELAKHAVSEGTKAVTKYTSSK,0,126,127,MPEVAVKGATISKKGFKKAVTKTQKKEGRKRKRCRKESYSIYIYKVLKQVHPDTGISSKAMSIMNSFVTDIFERIASEASRLAHYNKRSTITSREIQTAVRLLLPGELAKHAVSEGTKAVTKYTSSK,14437.80782969,14446.82488,,RESID:55@6|RESID:55@16|RESID:55@17|RESID:55@21|RESID:55@24,,,1
10505,H2B1A_MOUSE,P70696,Histone H2B type 1-A,P70696,,MPEVAVKGATISKKGFKKAVTKTQKKEGRKRKRCRKESYSIYIYKVLKQVHPDTGISSKAMSIMNSFVTDIFERIASEASRLAHYNKRSTITSREIQTAVRLLLPGELAKHAVSEGTKAVTKYTSSK,0,126,127,MPEVAVKGATISKKGFKKAVTKTQKKEGRKRKRCRKESYSIYIYKVLKQVHPDTGISSKAMSIMNSFVTDIFERIASEASRLAHYNKRSTITSREIQTAVRLLLPGELAKHAVSEGTKAVTKYTSSK,14479.81839469,14488.86488,,RESID:49@0|RESID:55@6|RESID:55@13|RESID:55@16|RESID:55@21|RESID:55@24,,,1
10508,H2B1A_MOUSE,P70696,Histone H2B type 1-A,P70696,,MPEVAVKGATISKKGFKKAVTKTQKKEGRKRKRCRKESYSIYIYKVLKQVHPDTGISSKAMSIMNSFVTDIFERIASEASRLAHYNKRSTITSREIQTAVRLLLPGELAKHAVSEGTKAVTKYTSSK,1,126,126,PEVAVKGATISKKGFKKAVTKTQKKEGRKRKRCRKESYSIYIYKVLKQVHPDTGISSKAMSIMNSFVTDIFERIASEASRLAHYNKRSTITSREIQTAVRLLLPGELAKHAVSEGTKAVTKYTSSK,14096.71451469,14105.43228,,,,,1
10625,H2B1A_MOUSE,P70696,Histone H2B type 1-A,P70696,,MPEVAVKGATISKKGFKKAVTKTQKKEGRKRKRCRKESYSIYIYKVLKQVHPDTGISSKAMSIMNSFVTDIFERIASEASRLAHYNKRSTITSREIQTAVRLLLPGELAKHAVSEGTKAVTKYTSSK,0,126,127,MPEVAVKGATISKKGFKKAVTKTQKKEGRKRKRCRKESYSIYIYKVLKQVHPDTGISSKAMSIMNSFVTDIFERIASEASRLAHYNKRSTITSREIQTAVRLLLPGELAKHAVSEGTKAVTKYTSSK,14521.82895969,14530.90488,,RESID:49@0|RESID:55@6|RESID:55@13|RESID:55@16|RESID:55@17|RESID:55@21|RESID:55@24,,,1
10642,H2B1A_MOUSE,P70696,Histone H2B type 1-A,P70696,,MPEVAVKGATISKKGFKKAVTKTQKKEGRKRKRCRKESYSIYIYKVLKQVHPDTGISSKAMSIMNSFVTDIFERIASEASRLAHYNKRSTITSREIQTAVRLLLPGELAKHAVSEGTKAVTKYTSSK,0,126,127,MPEVAVKGATISKKGFKKAVTKTQKKEGRKRKRCRKESYSIYIYKVLKQVHPDTGISSKAMSIMNSFVTDIFERIASEASRLAHYNKRSTITSREIQTAVRLLLPGELAKHAVSEGTKAVTKYTSSK,14395.79726469,14404.78488,,RESID:55@6|RESID:55@16|RESID:55@21|RESID:55@24,,,1
10676,H2B1A_MOUSE,P70696,Histone H2B type 1-A,P70696,,MPEVAVKGATISKKGFKKAVTKTQKKEGRKRKRCRKESYSIYIYKVLKQVHPDTGISSKAMSIMNSFVTDIFERIASEASRLAHYNKRSTITSREIQTAVRLLLPGELAKHAVSEGTKAVTKYTSSK,0,126,127,MPEVAVKGATISKKGFKKAVTKTQKKEGRKRKRCRKESYSIYIYKVLKQVHPDTGISSKAMSIMNSFVTDIFERIASEASRLAHYNKRSTITSREIQTAVRLLLPGELAKHAVSEGTKAVTKYTSSK,14605.85008969,14614.98488,,RESID:49@0|RESID:55@6|RESID:55@12|RESID:55@13|RESID:55@16|RESID:55@17|RESID:55@21|RESID:55@24|RESID:55@109,,,1
