PFR,UniProt Id,Entry Accession,Entry Description,Isoform Accession,Isoform Description,Isoform Sequence,Start,End,Length,Proteoform Sequence,Monoisotopic Mass,Average Mass,Sequence Modifications,PTMs,N-Terminal,C-Terminal,Star
4187,RT36_HUMAN,P82909,28S ribosomal protein S36; mitochondrial,P82909,,MMGSKMASASRVVQVVKPHTPLIRFPDRRDNPKPNVSEALRSAGLPSHSSVISQHSKGSKSPDLLMYQGPPDTAEIIKTLPQKYRRKLVSQEEMEFIQRGGPE,1,102,102,MGSKMASASRVVQVVKPHTPLIRFPDRRDNPKPNVSEALRSAGLPSHSSVISQHSKGSKSPDLLMYQGPPDTAEIIKTLPQKYRRKLVSQEEMEFIQRGGPE,11327.92362469,11335.00818,,,,,1
6454,RT36_HUMAN,P82909,28S ribosomal protein S36; mitochondrial,P82909,,MMGSKMASASRVVQVVKPHTPLIRFPDRRDNPKPNVSEALRSAGLPSHSSVISQHSKGSKSPDLLMYQGPPDTAEIIKTLPQKYRRKLVSQEEMEFIQRGGPE,0,102,103,MMGSKMASASRVVQVVKPHTPLIRFPDRRDNPKPNVSEALRSAGLPSHSSVISQHSKGSKSPDLLMYQGPPDTAEIIKTLPQKYRRKLVSQEEMEFIQRGGPE,11500.97467969,11508.24078,,RESID:49@0,,,1
6580,RT36_HUMAN,P82909,28S ribosomal protein S36; mitochondrial,P82909,,MMGSKMASASRVVQVVKPHTPLIRFPDRRDNPKPNVSEALRSAGLPSHSSVISQHSKGSKSPDLLMYQGPPDTAEIIKTLPQKYRRKLVSQEEMEFIQRGGPE,1,102,102,MGSKMASASRVVQVVKPHTPLIRFPDRRDNPKPNVSEALRSAGLPSHSSVISQHSKGSKSPDLLMYQGPPDTAEIIKTLPQKYRRKLVSQEEMEFIQRGGPE,11407.88995569,11414.98818,,RESID:37@59,,,1
12365,RT36_HUMAN,P82909,28S ribosomal protein S36; mitochondrial,P82909,,MMGSKMASASRVVQVVKPHTPLIRFPDRRDNPKPNVSEALRSAGLPSHSSVISQHSKGSKSPDLLMYQGPPDTAEIIKTLPQKYRRKLVSQEEMEFIQRGGPE,1,102,102,MGSKMASASRVVQVVKPHTPLIRFPDRRDNPKPNVSEALRSAGLPSHSSVISQHSKGSKSPDLLMYQGPPDTAEIIKTLPQKYRRKLVSQEEMEFIQRGGPE,11369.93418969,11377.04818,,RESID:49@0,,,1
12366,RT36_HUMAN,P82909,28S ribosomal protein S36; mitochondrial,P82909,,MMGSKMASASRVVQVVKPHTPLIRFPDRRDNPKPNVSEALRSAGLPSHSSVISQHSKGSKSPDLLMYQGPPDTAEIIKTLPQKYRRKLVSQEEMEFIQRGGPE,0,102,103,MMGSKMASASRVVQVVKPHTPLIRFPDRRDNPKPNVSEALRSAGLPSHSSVISQHSKGSKSPDLLMYQGPPDTAEIIKTLPQKYRRKLVSQEEMEFIQRGGPE,11458.96411469,11466.20078,,,,,1
12456,RT36_HUMAN,P82909,28S ribosomal protein S36; mitochondrial,P82909,,MMGSKMASASRVVQVVKPHTPLIRFPDRRDNPKPNVSEALRSAGLPSHSSVISQHSKGSKSPDLLMYQGPPDTAEIIKTLPQKYRRKLVSQEEMEFIQRGGPE,0,102,103,MMGSKMASASRVVQVVKPHTPLIRFPDRRDNPKPNVSEALRSAGLPSHSSVISQHSKGSKSPDLLMYQGPPDTAEIIKTLPQKYRRKLVSQEEMEFIQRGGPE,11538.93044569,11546.18078,,RESID:37@60,,,1
12559,RT36_HUMAN,P82909,28S ribosomal protein S36; mitochondrial,P82909,,MMGSKMASASRVVQVVKPHTPLIRFPDRRDNPKPNVSEALRSAGLPSHSSVISQHSKGSKSPDLLMYQGPPDTAEIIKTLPQKYRRKLVSQEEMEFIQRGGPE,0,102,103,MMGSKMASASRVVQVVKPHTPLIRFPDRRDNPKPNVSEALRSAGLPSHSSVISQHSKGSKSPDLLMYQGPPDTAEIIKTLPQKYRRKLVSQEEMEFIQRGGPE,11580.94101069,11588.22078,,RESID:49@0|RESID:37@60,,,1
13676,RT36_HUMAN,P82909,28S ribosomal protein S36; mitochondrial,P82909,,MMGSKMASASRVVQVVKPHTPLIRFPDRRDNPKPNVSEALRSAGLPSHSSVISQHSKGSKSPDLLMYQGPPDTAEIIKTLPQKYRRKLVSQEEMEFIQRGGPE,1,102,102,MGSKMASASRVVQVVKPHTPLIRFPDRRDNPKPNVSEALRSAGLPSHSSVISQHSKGSKSPDLLMYQGPPDTAEIIKTLPQKYRRKLVSQEEMEFIQRGGPE,11449.90052069,11457.02818,,RESID:49@0|RESID:37@59,,,1
16011,RT36_HUMAN,P82909,28S ribosomal protein S36; mitochondrial,P82909,,MMGSKMASASRVVQVVKPHTPLIRFPDRRDNPKPNVSEALRSAGLPSHSSVISQHSKGSKSPDLLMYQGPPDTAEIIKTLPQKYRRKLVSQEEMEFIQRGGPE,0,102,103,MMGSKMASASRVVQVVKPHTPLIRFPDRRDNPKPNVSEALRSAGLPSHSSVISQHSKGSKSPDLLMYQGPPDTAEIIKTLPQKYRRKLVSQEEMEFIQRGGPE,11500.97468,11508.24078,,,PSI-MOD:1458,,0
16199,RT36_HUMAN,P82909,28S ribosomal protein S36; mitochondrial,P82909,,MMGSKMASASRVVQVVKPHTPLIRFPDRRDNPKPNVSEALRSAGLPSHSSVISQHSKGSKSPDLLMYQGPPDTAEIIKTLPQKYRRKLVSQEEMEFIQRGGPE,1,102,102,MGSKMASASRVVQVVKPHTPLIRFPDRRDNPKPNVSEALRSAGLPSHSSVISQHSKGSKSPDLLMYQGPPDTAEIIKTLPQKYRRKLVSQEEMEFIQRGGPE,11369.93419,11377.04818,,,PSI-MOD:1458,,0
17096,RT36_HUMAN,P82909,28S ribosomal protein S36; mitochondrial,P82909,,MMGSKMASASRVVQVVKPHTPLIRFPDRRDNPKPNVSEALRSAGLPSHSSVISQHSKGSKSPDLLMYQGPPDTAEIIKTLPQKYRRKLVSQEEMEFIQRGGPE,1,102,102,MGSKMASASRVVQVVKPHTPLIRFPDRRDNPKPNVSEALRSAGLPSHSSVISQHSKGSKSPDLLMYQGPPDTAEIIKTLPQKYRRKLVSQEEMEFIQRGGPE,11427.93967,11435.07818,,RESID:545@3,,,0
