PFR,UniProt Id,Entry Accession,Entry Description,Isoform Accession,Isoform Description,Isoform Sequence,Start,End,Length,Proteoform Sequence,Monoisotopic Mass,Average Mass,Sequence Modifications,PTMs,N-Terminal,C-Terminal,Star
8701,RS5_MOUSE,P97461,40S ribosomal protein S5,P97461,,MTEWEAATPAVAETPDIKLFGKWSTDDVQINDISLQDYIAVKEKYAKYLPHSAGRYAAKRFRKAQCPIVERLTNSMMMHGRNNGKKLMTVRIVKHAFEIIHLLTGENPLQVLVNAIINSGPREDSTRIGRAGTVRRQAVDVSPLRRVNQAIWLLCTGAREAAFRNIKNIAECLADELINAAKGSSNSYAIKKKDELERVAKSNR,1,203,203,TEWEAATPAVAETPDIKLFGKWSTDDVQINDISLQDYIAVKEKYAKYLPHSAGRYAAKRFRKAQCPIVERLTNSMMMHGRNNGKKLMTVRIVKHAFEIIHLLTGENPLQVLVNAIINSGPREDSTRIGRAGTVRRQAVDVSPLRRVNQAIWLLCTGAREAAFRNIKNIAECLADELINAAKGSSNSYAIKKKDELERVAKSNR,22865.98366069,22880.22158,,RESID:52@0|RESID:37@140,,,1
8738,RS5_MOUSE,P97461,40S ribosomal protein S5,P97461,,MTEWEAATPAVAETPDIKLFGKWSTDDVQINDISLQDYIAVKEKYAKYLPHSAGRYAAKRFRKAQCPIVERLTNSMMMHGRNNGKKLMTVRIVKHAFEIIHLLTGENPLQVLVNAIINSGPREDSTRIGRAGTVRRQAVDVSPLRRVNQAIWLLCTGAREAAFRNIKNIAECLADELINAAKGSSNSYAIKKKDELERVAKSNR,1,203,203,TEWEAATPAVAETPDIKLFGKWSTDDVQINDISLQDYIAVKEKYAKYLPHSAGRYAAKRFRKAQCPIVERLTNSMMMHGRNNGKKLMTVRIVKHAFEIIHLLTGENPLQVLVNAIINSGPREDSTRIGRAGTVRRQAVDVSPLRRVNQAIWLLCTGAREAAFRNIKNIAECLADELINAAKGSSNSYAIKKKDELERVAKSNR,22828.02789469,22842.28158,,RESID:52@0|RESID:55@45,,,1
8745,RS5_MOUSE,P97461,40S ribosomal protein S5,P97461,,MTEWEAATPAVAETPDIKLFGKWSTDDVQINDISLQDYIAVKEKYAKYLPHSAGRYAAKRFRKAQCPIVERLTNSMMMHGRNNGKKLMTVRIVKHAFEIIHLLTGENPLQVLVNAIINSGPREDSTRIGRAGTVRRQAVDVSPLRRVNQAIWLLCTGAREAAFRNIKNIAECLADELINAAKGSSNSYAIKKKDELERVAKSNR,1,203,203,TEWEAATPAVAETPDIKLFGKWSTDDVQINDISLQDYIAVKEKYAKYLPHSAGRYAAKRFRKAQCPIVERLTNSMMMHGRNNGKKLMTVRIVKHAFEIIHLLTGENPLQVLVNAIINSGPREDSTRIGRAGTVRRQAVDVSPLRRVNQAIWLLCTGAREAAFRNIKNIAECLADELINAAKGSSNSYAIKKKDELERVAKSNR,22907.99422569,22922.26158,,RESID:52@0|RESID:55@45|RESID:37@140,,,1
8797,RS5_MOUSE,P97461,40S ribosomal protein S5,P97461,,MTEWEAATPAVAETPDIKLFGKWSTDDVQINDISLQDYIAVKEKYAKYLPHSAGRYAAKRFRKAQCPIVERLTNSMMMHGRNNGKKLMTVRIVKHAFEIIHLLTGENPLQVLVNAIINSGPREDSTRIGRAGTVRRQAVDVSPLRRVNQAIWLLCTGAREAAFRNIKNIAECLADELINAAKGSSNSYAIKKKDELERVAKSNR,0,203,204,MTEWEAATPAVAETPDIKLFGKWSTDDVQINDISLQDYIAVKEKYAKYLPHSAGRYAAKRFRKAQCPIVERLTNSMMMHGRNNGKKLMTVRIVKHAFEIIHLLTGENPLQVLVNAIINSGPREDSTRIGRAGTVRRQAVDVSPLRRVNQAIWLLCTGAREAAFRNIKNIAECLADELINAAKGSSNSYAIKKKDELERVAKSNR,23039.03471569,23053.45418,,RESID:49@0|RESID:52@1|RESID:37@141,,,1
9424,RS5_MOUSE,P97461,40S ribosomal protein S5,P97461,,MTEWEAATPAVAETPDIKLFGKWSTDDVQINDISLQDYIAVKEKYAKYLPHSAGRYAAKRFRKAQCPIVERLTNSMMMHGRNNGKKLMTVRIVKHAFEIIHLLTGENPLQVLVNAIINSGPREDSTRIGRAGTVRRQAVDVSPLRRVNQAIWLLCTGAREAAFRNIKNIAECLADELINAAKGSSNSYAIKKKDELERVAKSNR,1,203,203,TEWEAATPAVAETPDIKLFGKWSTDDVQINDISLQDYIAVKEKYAKYLPHSAGRYAAKRFRKAQCPIVERLTNSMMMHGRNNGKKLMTVRIVKHAFEIIHLLTGENPLQVLVNAIINSGPREDSTRIGRAGTVRRQAVDVSPLRRVNQAIWLLCTGAREAAFRNIKNIAECLADELINAAKGSSNSYAIKKKDELERVAKSNR,22786.01732969,22800.24158,,RESID:52@0,,,1
9430,RS5_MOUSE,P97461,40S ribosomal protein S5,P97461,,MTEWEAATPAVAETPDIKLFGKWSTDDVQINDISLQDYIAVKEKYAKYLPHSAGRYAAKRFRKAQCPIVERLTNSMMMHGRNNGKKLMTVRIVKHAFEIIHLLTGENPLQVLVNAIINSGPREDSTRIGRAGTVRRQAVDVSPLRRVNQAIWLLCTGAREAAFRNIKNIAECLADELINAAKGSSNSYAIKKKDELERVAKSNR,0,203,204,MTEWEAATPAVAETPDIKLFGKWSTDDVQINDISLQDYIAVKEKYAKYLPHSAGRYAAKRFRKAQCPIVERLTNSMMMHGRNNGKKLMTVRIVKHAFEIIHLLTGENPLQVLVNAIINSGPREDSTRIGRAGTVRRQAVDVSPLRRVNQAIWLLCTGAREAAFRNIKNIAECLADELINAAKGSSNSYAIKKKDELERVAKSNR,23039.03471569,23053.45418,,RESID:49@0|RESID:55@46|RESID:37@141,,,1
9526,RS5_MOUSE,P97461,40S ribosomal protein S5,P97461,,MTEWEAATPAVAETPDIKLFGKWSTDDVQINDISLQDYIAVKEKYAKYLPHSAGRYAAKRFRKAQCPIVERLTNSMMMHGRNNGKKLMTVRIVKHAFEIIHLLTGENPLQVLVNAIINSGPREDSTRIGRAGTVRRQAVDVSPLRRVNQAIWLLCTGAREAAFRNIKNIAECLADELINAAKGSSNSYAIKKKDELERVAKSNR,0,203,204,MTEWEAATPAVAETPDIKLFGKWSTDDVQINDISLQDYIAVKEKYAKYLPHSAGRYAAKRFRKAQCPIVERLTNSMMMHGRNNGKKLMTVRIVKHAFEIIHLLTGENPLQVLVNAIINSGPREDSTRIGRAGTVRRQAVDVSPLRRVNQAIWLLCTGAREAAFRNIKNIAECLADELINAAKGSSNSYAIKKKDELERVAKSNR,22917.05781969,22931.43418,,RESID:49@0,,,1
9785,RS5_MOUSE,P97461,40S ribosomal protein S5,P97461,,MTEWEAATPAVAETPDIKLFGKWSTDDVQINDISLQDYIAVKEKYAKYLPHSAGRYAAKRFRKAQCPIVERLTNSMMMHGRNNGKKLMTVRIVKHAFEIIHLLTGENPLQVLVNAIINSGPREDSTRIGRAGTVRRQAVDVSPLRRVNQAIWLLCTGAREAAFRNIKNIAECLADELINAAKGSSNSYAIKKKDELERVAKSNR,1,203,203,TEWEAATPAVAETPDIKLFGKWSTDDVQINDISLQDYIAVKEKYAKYLPHSAGRYAAKRFRKAQCPIVERLTNSMMMHGRNNGKKLMTVRIVKHAFEIIHLLTGENPLQVLVNAIINSGPREDSTRIGRAGTVRRQAVDVSPLRRVNQAIWLLCTGAREAAFRNIKNIAECLADELINAAKGSSNSYAIKKKDELERVAKSNR,22744.00676469,22758.20158,,,,,1
