PFR,UniProt Id,Entry Accession,Entry Description,Isoform Accession,Isoform Description,Isoform Sequence,Start,End,Length,Proteoform Sequence,Monoisotopic Mass,Average Mass,Sequence Modifications,PTMs,N-Terminal,C-Terminal,Star
8644,Q0VGU2_MOUSE,Q0VGU2,SubName: Full=Prothymosin alpha {ECO:0000313|EMBL:AAH85171.1};,Q0VGU2,,MSDAAVDTSSEITTKDLKEKKEVVEEAENGRDAPANGNAQNEENGEQEADNEVDEEEEEGGEEEEEEEEGDGEEEDGDEDEEAEAPTGKRVAEDDEDDDVDTKKQKTEEDD,1,110,110,SDAAVDTSSEITTKDLKEKKEVVEEAENGRDAPANGNAQNEENGEQEADNEVDEEEEEGGEEEEEEEEGDGEEEDGDEDEEAEAPTGKRVAEDDEDDDVDTKKQKTEEDD,12158.02242969,12164.94338,,RESID:51@0,,,1
8673,Q0VGU2_MOUSE,Q0VGU2,SubName: Full=Prothymosin alpha {ECO:0000313|EMBL:AAH85171.1};,Q0VGU2,,MSDAAVDTSSEITTKDLKEKKEVVEEAENGRDAPANGNAQNEENGEQEADNEVDEEEEEGGEEEEEEEEGDGEEEDGDEDEEAEAPTGKRVAEDDEDDDVDTKKQKTEEDD,1,110,110,SDAAVDTSSEITTKDLKEKKEVVEEAENGRDAPANGNAQNEENGEQEADNEVDEEEEEGGEEEEEEEEGDGEEEDGDEDEEAEAPTGKRVAEDDEDDDVDTKKQKTEEDD,12557.85408469,12564.84338,,RESID:51@0|RESID:38@6|RESID:37@7|RESID:37@8|RESID:38@11|RESID:38@12,,,1
8733,Q0VGU2_MOUSE,Q0VGU2,SubName: Full=Prothymosin alpha {ECO:0000313|EMBL:AAH85171.1};,Q0VGU2,,MSDAAVDTSSEITTKDLKEKKEVVEEAENGRDAPANGNAQNEENGEQEADNEVDEEEEEGGEEEEEEEEGDGEEEDGDEDEEAEAPTGKRVAEDDEDDDVDTKKQKTEEDD,1,110,110,SDAAVDTSSEITTKDLKEKKEVVEEAENGRDAPANGNAQNEENGEQEADNEVDEEEEEGGEEEEEEEEGDGEEEDGDEDEEAEAPTGKRVAEDDEDDDVDTKKQKTEEDD,12599.86464969,12606.88338,,RESID:51@0|RESID:38@6|RESID:37@7|RESID:37@8|RESID:38@11|RESID:38@12|RESID:55@13,,,1
8855,Q0VGU2_MOUSE,Q0VGU2,SubName: Full=Prothymosin alpha {ECO:0000313|EMBL:AAH85171.1};,Q0VGU2,,MSDAAVDTSSEITTKDLKEKKEVVEEAENGRDAPANGNAQNEENGEQEADNEVDEEEEEGGEEEEEEEEGDGEEEDGDEDEEAEAPTGKRVAEDDEDDDVDTKKQKTEEDD,1,110,110,SDAAVDTSSEITTKDLKEKKEVVEEAENGRDAPANGNAQNEENGEQEADNEVDEEEEEGGEEEEEEEEGDGEEEDGDEDEEAEAPTGKRVAEDDEDDDVDTKKQKTEEDD,12116.01186469,12122.90338,,,,,1
9111,Q0VGU2_MOUSE,Q0VGU2,SubName: Full=Prothymosin alpha {ECO:0000313|EMBL:AAH85171.1};,Q0VGU2,,MSDAAVDTSSEITTKDLKEKKEVVEEAENGRDAPANGNAQNEENGEQEADNEVDEEEEEGGEEEEEEEEGDGEEEDGDEDEEAEAPTGKRVAEDDEDDDVDTKKQKTEEDD,1,110,110,SDAAVDTSSEITTKDLKEKKEVVEEAENGRDAPANGNAQNEENGEQEADNEVDEEEEEGGEEEEEEEEGDGEEEDGDEDEEAEAPTGKRVAEDDEDDDVDTKKQKTEEDD,12317.95509169,12324.90338,,RESID:51@0|RESID:38@6|RESID:37@7,,,1
9379,Q0VGU2_MOUSE,Q0VGU2,SubName: Full=Prothymosin alpha {ECO:0000313|EMBL:AAH85171.1};,Q0VGU2,,MSDAAVDTSSEITTKDLKEKKEVVEEAENGRDAPANGNAQNEENGEQEADNEVDEEEEEGGEEEEEEEEGDGEEEDGDEDEEAEAPTGKRVAEDDEDDDVDTKKQKTEEDD,0,110,111,MSDAAVDTSSEITTKDLKEKKEVVEEAENGRDAPANGNAQNEENGEQEADNEVDEEEEEGGEEEEEEEEGDGEEEDGDEDEEAEAPTGKRVAEDDEDDDVDTKKQKTEEDD,12289.06291969,12296.13598,,RESID:51@1,,,1
9592,Q0VGU2_MOUSE,Q0VGU2,SubName: Full=Prothymosin alpha {ECO:0000313|EMBL:AAH85171.1};,Q0VGU2,,MSDAAVDTSSEITTKDLKEKKEVVEEAENGRDAPANGNAQNEENGEQEADNEVDEEEEEGGEEEEEEEEGDGEEEDGDEDEEAEAPTGKRVAEDDEDDDVDTKKQKTEEDD,0,110,111,MSDAAVDTSSEITTKDLKEKKEVVEEAENGRDAPANGNAQNEENGEQEADNEVDEEEEEGGEEEEEEEEGDGEEEDGDEDEEAEAPTGKRVAEDDEDDDVDTKKQKTEEDD,12289.06291969,12296.13598,,RESID:49@0,,,1
10598,Q0VGU2_MOUSE,Q0VGU2,SubName: Full=Prothymosin alpha {ECO:0000313|EMBL:AAH85171.1};,Q0VGU2,,MSDAAVDTSSEITTKDLKEKKEVVEEAENGRDAPANGNAQNEENGEQEADNEVDEEEEEGGEEEEEEEEGDGEEEDGDEDEEAEAPTGKRVAEDDEDDDVDTKKQKTEEDD,1,110,110,SDAAVDTSSEITTKDLKEKKEVVEEAENGRDAPANGNAQNEENGEQEADNEVDEEEEEGGEEEEEEEEGDGEEEDGDEDEEAEAPTGKRVAEDDEDDDVDTKKQKTEEDD,12317.95509169,12324.90338,,RESID:38@6|RESID:37@7|RESID:55@13,,,1
