PFR,UniProt Id,Entry Accession,Entry Description,Isoform Accession,Isoform Description,Isoform Sequence,Start,End,Length,Proteoform Sequence,Monoisotopic Mass,Average Mass,Sequence Modifications,PTMs,N-Terminal,C-Terminal,Star
1317,IF4H_HUMAN,Q15056,Eukaryotic translation initiation factor 4H,Q15056-2,Short,MADFDTYDDRAYSSFGGGRGSRGSAGGHGSRSQKELPTEPPYTAYVGNLPFNTVQGDIDAIFKDLSIRSVRLVRDKDTDKFKGFCYVEFDEVDSLKEALTYDGALLGDRSLRVDIAEGRKQDKGGFGFRKGGPDDRGFRDDFLGGRGGSRPGDRRTGPPMGSRFRDGPPLRGSNMDFREPTEEERAQRPRLQLKPRTVATPLNQVANPNSAIFGGARPREEVVQKEQE,1,227,227,ADFDTYDDRAYSSFGGGRGSRGSAGGHGSRSQKELPTEPPYTAYVGNLPFNTVQGDIDAIFKDLSIRSVRLVRDKDTDKFKGFCYVEFDEVDSLKEALTYDGALLGDRSLRVDIAEGRKQDKGGFGFRKGGPDDRGFRDDFLGGRGGSRPGDRRTGPPMGSRFRDGPPLRGSNMDFREPTEEERAQRPRLQLKPRTVATPLNQVANPNSAIFGGARPREEVVQKEQE,25175.45761069,25190.66308,,RESID:41@0|RESID:39@99,,,1
1363,IF4H_HUMAN,Q15056,Eukaryotic translation initiation factor 4H,Q15056-2,Short,MADFDTYDDRAYSSFGGGRGSRGSAGGHGSRSQKELPTEPPYTAYVGNLPFNTVQGDIDAIFKDLSIRSVRLVRDKDTDKFKGFCYVEFDEVDSLKEALTYDGALLGDRSLRVDIAEGRKQDKGGFGFRKGGPDDRGFRDDFLGGRGGSRPGDRRTGPPMGSRFRDGPPLRGSNMDFREPTEEERAQRPRLQLKPRTVATPLNQVANPNSAIFGGARPREEVVQKEQE,1,227,227,ADFDTYDDRAYSSFGGGRGSRGSAGGHGSRSQKELPTEPPYTAYVGNLPFNTVQGDIDAIFKDLSIRSVRLVRDKDTDKFKGFCYVEFDEVDSLKEALTYDGALLGDRSLRVDIAEGRKQDKGGFGFRKGGPDDRGFRDDFLGGRGGSRPGDRRTGPPMGSRFRDGPPLRGSNMDFREPTEEERAQRPRLQLKPRTVATPLNQVANPNSAIFGGARPREEVVQKEQE,25095.49127969,25110.68308,,RESID:41@0,,,1
1436,IF4H_HUMAN,Q15056,Eukaryotic translation initiation factor 4H,Q15056-2,Short,MADFDTYDDRAYSSFGGGRGSRGSAGGHGSRSQKELPTEPPYTAYVGNLPFNTVQGDIDAIFKDLSIRSVRLVRDKDTDKFKGFCYVEFDEVDSLKEALTYDGALLGDRSLRVDIAEGRKQDKGGFGFRKGGPDDRGFRDDFLGGRGGSRPGDRRTGPPMGSRFRDGPPLRGSNMDFREPTEEERAQRPRLQLKPRTVATPLNQVANPNSAIFGGARPREEVVQKEQE,1,227,227,ADFDTYDDRAYSSFGGGRGSRGSAGGHGSRSQKELPTEPPYTAYVGNLPFNTVQGDIDAIFKDLSIRSVRLVRDKDTDKFKGFCYVEFDEVDSLKEALTYDGALLGDRSLRVDIAEGRKQDKGGFGFRKGGPDDRGFRDDFLGGRGGSRPGDRRTGPPMGSRFRDGPPLRGSNMDFREPTEEERAQRPRLQLKPRTVATPLNQVANPNSAIFGGARPREEVVQKEQE,25255.42394169,25270.64308,,RESID:41@0|RESID:39@99|RESID:37@171,,,1
1573,IF4H_HUMAN,Q15056,Eukaryotic translation initiation factor 4H,Q15056-2,Short,MADFDTYDDRAYSSFGGGRGSRGSAGGHGSRSQKELPTEPPYTAYVGNLPFNTVQGDIDAIFKDLSIRSVRLVRDKDTDKFKGFCYVEFDEVDSLKEALTYDGALLGDRSLRVDIAEGRKQDKGGFGFRKGGPDDRGFRDDFLGGRGGSRPGDRRTGPPMGSRFRDGPPLRGSNMDFREPTEEERAQRPRLQLKPRTVATPLNQVANPNSAIFGGARPREEVVQKEQE,1,227,227,ADFDTYDDRAYSSFGGGRGSRGSAGGHGSRSQKELPTEPPYTAYVGNLPFNTVQGDIDAIFKDLSIRSVRLVRDKDTDKFKGFCYVEFDEVDSLKEALTYDGALLGDRSLRVDIAEGRKQDKGGFGFRKGGPDDRGFRDDFLGGRGGSRPGDRRTGPPMGSRFRDGPPLRGSNMDFREPTEEERAQRPRLQLKPRTVATPLNQVANPNSAIFGGARPREEVVQKEQE,25175.45761069,25190.66308,,RESID:41@0|RESID:37@171,,,1
2552,IF4H_HUMAN,Q15056,Eukaryotic translation initiation factor 4H,Q15056-2,Short,MADFDTYDDRAYSSFGGGRGSRGSAGGHGSRSQKELPTEPPYTAYVGNLPFNTVQGDIDAIFKDLSIRSVRLVRDKDTDKFKGFCYVEFDEVDSLKEALTYDGALLGDRSLRVDIAEGRKQDKGGFGFRKGGPDDRGFRDDFLGGRGGSRPGDRRTGPPMGSRFRDGPPLRGSNMDFREPTEEERAQRPRLQLKPRTVATPLNQVANPNSAIFGGARPREEVVQKEQE,1,227,227,ADFDTYDDRAYSSFGGGRGSRGSAGGHGSRSQKELPTEPPYTAYVGNLPFNTVQGDIDAIFKDLSIRSVRLVRDKDTDKFKGFCYVEFDEVDSLKEALTYDGALLGDRSLRVDIAEGRKQDKGGFGFRKGGPDDRGFRDDFLGGRGGSRPGDRRTGPPMGSRFRDGPPLRGSNMDFREPTEEERAQRPRLQLKPRTVATPLNQVANPNSAIFGGARPREEVVQKEQE,25137.50184469,25152.72308,,RESID:41@0|RESID:55@223,,,1
3025,IF4H_HUMAN,Q15056,Eukaryotic translation initiation factor 4H,Q15056-2,Short,MADFDTYDDRAYSSFGGGRGSRGSAGGHGSRSQKELPTEPPYTAYVGNLPFNTVQGDIDAIFKDLSIRSVRLVRDKDTDKFKGFCYVEFDEVDSLKEALTYDGALLGDRSLRVDIAEGRKQDKGGFGFRKGGPDDRGFRDDFLGGRGGSRPGDRRTGPPMGSRFRDGPPLRGSNMDFREPTEEERAQRPRLQLKPRTVATPLNQVANPNSAIFGGARPREEVVQKEQE,1,227,227,ADFDTYDDRAYSSFGGGRGSRGSAGGHGSRSQKELPTEPPYTAYVGNLPFNTVQGDIDAIFKDLSIRSVRLVRDKDTDKFKGFCYVEFDEVDSLKEALTYDGALLGDRSLRVDIAEGRKQDKGGFGFRKGGPDDRGFRDDFLGGRGGSRPGDRRTGPPMGSRFRDGPPLRGSNMDFREPTEEERAQRPRLQLKPRTVATPLNQVANPNSAIFGGARPREEVVQKEQE,25175.45761069,25190.66308,,RESID:41@0|RESID:39@43,,,1
3760,IF4H_HUMAN,Q15056,Eukaryotic translation initiation factor 4H,Q15056-2,Short,MADFDTYDDRAYSSFGGGRGSRGSAGGHGSRSQKELPTEPPYTAYVGNLPFNTVQGDIDAIFKDLSIRSVRLVRDKDTDKFKGFCYVEFDEVDSLKEALTYDGALLGDRSLRVDIAEGRKQDKGGFGFRKGGPDDRGFRDDFLGGRGGSRPGDRRTGPPMGSRFRDGPPLRGSNMDFREPTEEERAQRPRLQLKPRTVATPLNQVANPNSAIFGGARPREEVVQKEQE,1,227,227,ADFDTYDDRAYSSFGGGRGSRGSAGGHGSRSQKELPTEPPYTAYVGNLPFNTVQGDIDAIFKDLSIRSVRLVRDKDTDKFKGFCYVEFDEVDSLKEALTYDGALLGDRSLRVDIAEGRKQDKGGFGFRKGGPDDRGFRDDFLGGRGGSRPGDRRTGPPMGSRFRDGPPLRGSNMDFREPTEEERAQRPRLQLKPRTVATPLNQVANPNSAIFGGARPREEVVQKEQE,25335.39027269,25350.62308,,RESID:41@0|RESID:39@43|RESID:39@99|RESID:37@171,,,1
13870,IF4H_HUMAN,Q15056,Eukaryotic translation initiation factor 4H,Q15056-2,Short,MADFDTYDDRAYSSFGGGRGSRGSAGGHGSRSQKELPTEPPYTAYVGNLPFNTVQGDIDAIFKDLSIRSVRLVRDKDTDKFKGFCYVEFDEVDSLKEALTYDGALLGDRSLRVDIAEGRKQDKGGFGFRKGGPDDRGFRDDFLGGRGGSRPGDRRTGPPMGSRFRDGPPLRGSNMDFREPTEEERAQRPRLQLKPRTVATPLNQVANPNSAIFGGARPREEVVQKEQE,1,227,227,ADFDTYDDRAYSSFGGGRGSRGSAGGHGSRSQKELPTEPPYTAYVGNLPFNTVQGDIDAIFKDLSIRSVRLVRDKDTDKFKGFCYVEFDEVDSLKEALTYDGALLGDRSLRVDIAEGRKQDKGGFGFRKGGPDDRGFRDDFLGGRGGSRPGDRRTGPPMGSRFRDGPPLRGSNMDFREPTEEERAQRPRLQLKPRTVATPLNQVANPNSAIFGGARPREEVVQKEQE,25053.48071469,25068.64308,,,,,1
