PFR,UniProt Id,Entry Accession,Entry Description,Isoform Accession,Isoform Description,Isoform Sequence,Start,End,Length,Proteoform Sequence,Monoisotopic Mass,Average Mass,Sequence Modifications,PTMs,N-Terminal,C-Terminal,Star
8883,H2B1H_MOUSE,Q64478,Histone H2B type 1-H,Q64478,,MPEPAKSAPAPKKGSKKALTKAQKKDGKKRKRSRKESYSVYVYKVLKQVHPDTGISSKAMGIMNSFVNDIFERIAGEASRLAHYNKRSTITSREIQTAVRLLLPGELAKHAVSEGTKAVTKYTSSK,1,125,125,PEPAKSAPAPKKGSKKALTKAQKKDGKKRKRSRKESYSVYVYKVLKQVHPDTGISSKAMGIMNSFVNDIFERIAGEASRLAHYNKRSTITSREIQTAVRLLLPGELAKHAVSEGTKAVTKYTSSK,13780.53243469,13788.97328,,,,,1
9205,H2B1H_MOUSE,Q64478,Histone H2B type 1-H,Q64478,,MPEPAKSAPAPKKGSKKALTKAQKKDGKKRKRSRKESYSVYVYKVLKQVHPDTGISSKAMGIMNSFVNDIFERIAGEASRLAHYNKRSTITSREIQTAVRLLLPGELAKHAVSEGTKAVTKYTSSK,1,125,125,PEPAKSAPAPKKGSKKALTKAQKKDGKKRKRSRKESYSVYVYKVLKQVHPDTGISSKAMGIMNSFVNDIFERIAGEASRLAHYNKRSTITSREIQTAVRLLLPGELAKHAVSEGTKAVTKYTSSK,13948.57469469,13957.13328,,RESID:55@10|RESID:55@11|RESID:55@19|RESID:55@22,,,1
9293,H2B1H_MOUSE,Q64478,Histone H2B type 1-H,Q64478,,MPEPAKSAPAPKKGSKKALTKAQKKDGKKRKRSRKESYSVYVYKVLKQVHPDTGISSKAMGIMNSFVNDIFERIAGEASRLAHYNKRSTITSREIQTAVRLLLPGELAKHAVSEGTKAVTKYTSSK,1,125,125,PEPAKSAPAPKKGSKKALTKAQKKDGKKRKRSRKESYSVYVYKVLKQVHPDTGISSKAMGIMNSFVNDIFERIAGEASRLAHYNKRSTITSREIQTAVRLLLPGELAKHAVSEGTKAVTKYTSSK,13944.51989569,13953.03328,,RESID:55@4|RESID:37@13|RESID:55@14,,,1
9340,H2B1H_MOUSE,Q64478,Histone H2B type 1-H,Q64478,,MPEPAKSAPAPKKGSKKALTKAQKKDGKKRKRSRKESYSVYVYKVLKQVHPDTGISSKAMGIMNSFVNDIFERIAGEASRLAHYNKRSTITSREIQTAVRLLLPGELAKHAVSEGTKAVTKYTSSK,0,125,126,MPEPAKSAPAPKKGSKKALTKAQKKDGKKRKRSRKESYSVYVYKVLKQVHPDTGISSKAMGIMNSFVNDIFERIAGEASRLAHYNKRSTITSREIQTAVRLLLPGELAKHAVSEGTKAVTKYTSSK,13995.59405469,14004.24588,,RESID:55@5|RESID:55@15,,,1
9366,H2B1H_MOUSE,Q64478,Histone H2B type 1-H,Q64478,,MPEPAKSAPAPKKGSKKALTKAQKKDGKKRKRSRKESYSVYVYKVLKQVHPDTGISSKAMGIMNSFVNDIFERIAGEASRLAHYNKRSTITSREIQTAVRLLLPGELAKHAVSEGTKAVTKYTSSK,0,125,126,MPEPAKSAPAPKKGSKKALTKAQKKDGKKRKRSRKESYSVYVYKVLKQVHPDTGISSKAMGIMNSFVNDIFERIAGEASRLAHYNKRSTITSREIQTAVRLLLPGELAKHAVSEGTKAVTKYTSSK,13995.59405469,14004.24588,,RESID:55@20|RESID:55@23,,,1
9369,H2B1H_MOUSE,Q64478,Histone H2B type 1-H,Q64478,,MPEPAKSAPAPKKGSKKALTKAQKKDGKKRKRSRKESYSVYVYKVLKQVHPDTGISSKAMGIMNSFVNDIFERIAGEASRLAHYNKRSTITSREIQTAVRLLLPGELAKHAVSEGTKAVTKYTSSK,0,125,126,MPEPAKSAPAPKKGSKKALTKAQKKDGKKRKRSRKESYSVYVYKVLKQVHPDTGISSKAMGIMNSFVNDIFERIAGEASRLAHYNKRSTITSREIQTAVRLLLPGELAKHAVSEGTKAVTKYTSSK,13911.57292469,13920.16588,,,,,1
9567,H2B1H_MOUSE,Q64478,Histone H2B type 1-H,Q64478,,MPEPAKSAPAPKKGSKKALTKAQKKDGKKRKRSRKESYSVYVYKVLKQVHPDTGISSKAMGIMNSFVNDIFERIAGEASRLAHYNKRSTITSREIQTAVRLLLPGELAKHAVSEGTKAVTKYTSSK,0,125,126,MPEPAKSAPAPKKGSKKALTKAQKKDGKKRKRSRKESYSVYVYKVLKQVHPDTGISSKAMGIMNSFVNDIFERIAGEASRLAHYNKRSTITSREIQTAVRLLLPGELAKHAVSEGTKAVTKYTSSK,14037.60461969,14046.28588,,RESID:55@5|RESID:55@15|RESID:55@16,,,1
9756,H2B1H_MOUSE,Q64478,Histone H2B type 1-H,Q64478,,MPEPAKSAPAPKKGSKKALTKAQKKDGKKRKRSRKESYSVYVYKVLKQVHPDTGISSKAMGIMNSFVNDIFERIAGEASRLAHYNKRSTITSREIQTAVRLLLPGELAKHAVSEGTKAVTKYTSSK,0,125,126,MPEPAKSAPAPKKGSKKALTKAQKKDGKKRKRSRKESYSVYVYKVLKQVHPDTGISSKAMGIMNSFVNDIFERIAGEASRLAHYNKRSTITSREIQTAVRLLLPGELAKHAVSEGTKAVTKYTSSK,14075.56038569,14084.22588,,RESID:55@5|RESID:37@14|RESID:55@15,,,1
9796,H2B1H_MOUSE,Q64478,Histone H2B type 1-H,Q64478,,MPEPAKSAPAPKKGSKKALTKAQKKDGKKRKRSRKESYSVYVYKVLKQVHPDTGISSKAMGIMNSFVNDIFERIAGEASRLAHYNKRSTITSREIQTAVRLLLPGELAKHAVSEGTKAVTKYTSSK,1,125,125,PEPAKSAPAPKKGSKKALTKAQKKDGKKRKRSRKESYSVYVYKVLKQVHPDTGISSKAMGIMNSFVNDIFERIAGEASRLAHYNKRSTITSREIQTAVRLLLPGELAKHAVSEGTKAVTKYTSSK,13864.55356469,13873.05328,,RESID:55@4|RESID:55@14,,,1
10184,H2B1H_MOUSE,Q64478,Histone H2B type 1-H,Q64478,,MPEPAKSAPAPKKGSKKALTKAQKKDGKKRKRSRKESYSVYVYKVLKQVHPDTGISSKAMGIMNSFVNDIFERIAGEASRLAHYNKRSTITSREIQTAVRLLLPGELAKHAVSEGTKAVTKYTSSK,1,125,125,PEPAKSAPAPKKGSKKALTKAQKKDGKKRKRSRKESYSVYVYKVLKQVHPDTGISSKAMGIMNSFVNDIFERIAGEASRLAHYNKRSTITSREIQTAVRLLLPGELAKHAVSEGTKAVTKYTSSK,13822.54299969,13831.01328,,RESID:55@10,,,1
10206,H2B1H_MOUSE,Q64478,Histone H2B type 1-H,Q64478,,MPEPAKSAPAPKKGSKKALTKAQKKDGKKRKRSRKESYSVYVYKVLKQVHPDTGISSKAMGIMNSFVNDIFERIAGEASRLAHYNKRSTITSREIQTAVRLLLPGELAKHAVSEGTKAVTKYTSSK,1,125,125,PEPAKSAPAPKKGSKKALTKAQKKDGKKRKRSRKESYSVYVYKVLKQVHPDTGISSKAMGIMNSFVNDIFERIAGEASRLAHYNKRSTITSREIQTAVRLLLPGELAKHAVSEGTKAVTKYTSSK,13860.49876569,13868.95328,,RESID:37@13,,,1
