PFR,UniProt Id,Entry Accession,Entry Description,Isoform Accession,Isoform Description,Isoform Sequence,Start,End,Length,Proteoform Sequence,Monoisotopic Mass,Average Mass,Sequence Modifications,PTMs,N-Terminal,C-Terminal,Star
1244,IF5AL_HUMAN,Q6IS14,Eukaryotic translation initiation factor 5A-1-like,Q6IS14,,MADDLDFETGDAGASATFPMQCSALRKNGFVVLKGWPCKIVEMSASKTGKHGHAKVHLVGIDIFTGKKYEDICPSTHNMDVPNIKRNDFQLIGIQDGYLSLLQDSGEVPEDLRLPEGDLGKEIEQKYDCGEEILITVLSAMTEEAAVAIKAMAK,1,153,153,ADDLDFETGDAGASATFPMQCSALRKNGFVVLKGWPCKIVEMSASKTGKHGHAKVHLVGIDIFTGKKYEDICPSTHNMDVPNIKRNDFQLIGIQDGYLSLLQDSGEVPEDLRLPEGDLGKEIEQKYDCGEEILITVLSAMTEEAAVAIKAMAK,16715.30418469,16726.06588,,RESID:41@0|RESID:55@25,,,1
1250,IF5AL_HUMAN,Q6IS14,Eukaryotic translation initiation factor 5A-1-like,Q6IS14,,MADDLDFETGDAGASATFPMQCSALRKNGFVVLKGWPCKIVEMSASKTGKHGHAKVHLVGIDIFTGKKYEDICPSTHNMDVPNIKRNDFQLIGIQDGYLSLLQDSGEVPEDLRLPEGDLGKEIEQKYDCGEEILITVLSAMTEEAAVAIKAMAK,1,153,153,ADDLDFETGDAGASATFPMQCSALRKNGFVVLKGWPCKIVEMSASKTGKHGHAKVHLVGIDIFTGKKYEDICPSTHNMDVPNIKRNDFQLIGIQDGYLSLLQDSGEVPEDLRLPEGDLGKEIEQKYDCGEEILITVLSAMTEEAAVAIKAMAK,16673.29361969,16684.02588,,RESID:41@0,,,1
1286,IF5AL_HUMAN,Q6IS14,Eukaryotic translation initiation factor 5A-1-like,Q6IS14,,MADDLDFETGDAGASATFPMQCSALRKNGFVVLKGWPCKIVEMSASKTGKHGHAKVHLVGIDIFTGKKYEDICPSTHNMDVPNIKRNDFQLIGIQDGYLSLLQDSGEVPEDLRLPEGDLGKEIEQKYDCGEEILITVLSAMTEEAAVAIKAMAK,1,153,153,ADDLDFETGDAGASATFPMQCSALRKNGFVVLKGWPCKIVEMSASKTGKHGHAKVHLVGIDIFTGKKYEDICPSTHNMDVPNIKRNDFQLIGIQDGYLSLLQDSGEVPEDLRLPEGDLGKEIEQKYDCGEEILITVLSAMTEEAAVAIKAMAK,16802.37259869,16813.18588,,RESID:41@0|RESID:55@25|RESID:116@48,,,1
1419,IF5AL_HUMAN,Q6IS14,Eukaryotic translation initiation factor 5A-1-like,Q6IS14,,MADDLDFETGDAGASATFPMQCSALRKNGFVVLKGWPCKIVEMSASKTGKHGHAKVHLVGIDIFTGKKYEDICPSTHNMDVPNIKRNDFQLIGIQDGYLSLLQDSGEVPEDLRLPEGDLGKEIEQKYDCGEEILITVLSAMTEEAAVAIKAMAK,1,153,153,ADDLDFETGDAGASATFPMQCSALRKNGFVVLKGWPCKIVEMSASKTGKHGHAKVHLVGIDIFTGKKYEDICPSTHNMDVPNIKRNDFQLIGIQDGYLSLLQDSGEVPEDLRLPEGDLGKEIEQKYDCGEEILITVLSAMTEEAAVAIKAMAK,16718.35146869,16729.10588,,RESID:116@48,,,1
1480,IF5AL_HUMAN,Q6IS14,Eukaryotic translation initiation factor 5A-1-like,Q6IS14,,MADDLDFETGDAGASATFPMQCSALRKNGFVVLKGWPCKIVEMSASKTGKHGHAKVHLVGIDIFTGKKYEDICPSTHNMDVPNIKRNDFQLIGIQDGYLSLLQDSGEVPEDLRLPEGDLGKEIEQKYDCGEEILITVLSAMTEEAAVAIKAMAK,1,153,153,ADDLDFETGDAGASATFPMQCSALRKNGFVVLKGWPCKIVEMSASKTGKHGHAKVHLVGIDIFTGKKYEDICPSTHNMDVPNIKRNDFQLIGIQDGYLSLLQDSGEVPEDLRLPEGDLGKEIEQKYDCGEEILITVLSAMTEEAAVAIKAMAK,16802.37259869,16813.18588,,RESID:41@0|RESID:116@48|RESID:55@66,,,1
1484,IF5AL_HUMAN,Q6IS14,Eukaryotic translation initiation factor 5A-1-like,Q6IS14,,MADDLDFETGDAGASATFPMQCSALRKNGFVVLKGWPCKIVEMSASKTGKHGHAKVHLVGIDIFTGKKYEDICPSTHNMDVPNIKRNDFQLIGIQDGYLSLLQDSGEVPEDLRLPEGDLGKEIEQKYDCGEEILITVLSAMTEEAAVAIKAMAK,1,153,153,ADDLDFETGDAGASATFPMQCSALRKNGFVVLKGWPCKIVEMSASKTGKHGHAKVHLVGIDIFTGKKYEDICPSTHNMDVPNIKRNDFQLIGIQDGYLSLLQDSGEVPEDLRLPEGDLGKEIEQKYDCGEEILITVLSAMTEEAAVAIKAMAK,16757.31474969,16768.10588,,RESID:41@0|RESID:55@25|RESID:55@66,,,1
1591,IF5AL_HUMAN,Q6IS14,Eukaryotic translation initiation factor 5A-1-like,Q6IS14,,MADDLDFETGDAGASATFPMQCSALRKNGFVVLKGWPCKIVEMSASKTGKHGHAKVHLVGIDIFTGKKYEDICPSTHNMDVPNIKRNDFQLIGIQDGYLSLLQDSGEVPEDLRLPEGDLGKEIEQKYDCGEEILITVLSAMTEEAAVAIKAMAK,0,153,154,MADDLDFETGDAGASATFPMQCSALRKNGFVVLKGWPCKIVEMSASKTGKHGHAKVHLVGIDIFTGKKYEDICPSTHNMDVPNIKRNDFQLIGIQDGYLSLLQDSGEVPEDLRLPEGDLGKEIEQKYDCGEEILITVLSAMTEEAAVAIKAMAK,16849.39195869,16860.29848,,RESID:116@49,,,1
2103,IF5AL_HUMAN,Q6IS14,Eukaryotic translation initiation factor 5A-1-like,Q6IS14,,MADDLDFETGDAGASATFPMQCSALRKNGFVVLKGWPCKIVEMSASKTGKHGHAKVHLVGIDIFTGKKYEDICPSTHNMDVPNIKRNDFQLIGIQDGYLSLLQDSGEVPEDLRLPEGDLGKEIEQKYDCGEEILITVLSAMTEEAAVAIKAMAK,1,153,153,ADDLDFETGDAGASATFPMQCSALRKNGFVVLKGWPCKIVEMSASKTGKHGHAKVHLVGIDIFTGKKYEDICPSTHNMDVPNIKRNDFQLIGIQDGYLSLLQDSGEVPEDLRLPEGDLGKEIEQKYDCGEEILITVLSAMTEEAAVAIKAMAK,16631.28305469,16641.98588,,,,,1
2236,IF5AL_HUMAN,Q6IS14,Eukaryotic translation initiation factor 5A-1-like,Q6IS14,,MADDLDFETGDAGASATFPMQCSALRKNGFVVLKGWPCKIVEMSASKTGKHGHAKVHLVGIDIFTGKKYEDICPSTHNMDVPNIKRNDFQLIGIQDGYLSLLQDSGEVPEDLRLPEGDLGKEIEQKYDCGEEILITVLSAMTEEAAVAIKAMAK,0,153,154,MADDLDFETGDAGASATFPMQCSALRKNGFVVLKGWPCKIVEMSASKTGKHGHAKVHLVGIDIFTGKKYEDICPSTHNMDVPNIKRNDFQLIGIQDGYLSLLQDSGEVPEDLRLPEGDLGKEIEQKYDCGEEILITVLSAMTEEAAVAIKAMAK,16762.32354469,16773.17848,,,,,1
2337,IF5AL_HUMAN,Q6IS14,Eukaryotic translation initiation factor 5A-1-like,Q6IS14,,MADDLDFETGDAGASATFPMQCSALRKNGFVVLKGWPCKIVEMSASKTGKHGHAKVHLVGIDIFTGKKYEDICPSTHNMDVPNIKRNDFQLIGIQDGYLSLLQDSGEVPEDLRLPEGDLGKEIEQKYDCGEEILITVLSAMTEEAAVAIKAMAK,1,153,153,ADDLDFETGDAGASATFPMQCSALRKNGFVVLKGWPCKIVEMSASKTGKHGHAKVHLVGIDIFTGKKYEDICPSTHNMDVPNIKRNDFQLIGIQDGYLSLLQDSGEVPEDLRLPEGDLGKEIEQKYDCGEEILITVLSAMTEEAAVAIKAMAK,16844.38316369,16855.22588,,RESID:41@0|RESID:55@25|RESID:116@48|RESID:55@66,,,1
2403,IF5AL_HUMAN,Q6IS14,Eukaryotic translation initiation factor 5A-1-like,Q6IS14,,MADDLDFETGDAGASATFPMQCSALRKNGFVVLKGWPCKIVEMSASKTGKHGHAKVHLVGIDIFTGKKYEDICPSTHNMDVPNIKRNDFQLIGIQDGYLSLLQDSGEVPEDLRLPEGDLGKEIEQKYDCGEEILITVLSAMTEEAAVAIKAMAK,1,153,153,ADDLDFETGDAGASATFPMQCSALRKNGFVVLKGWPCKIVEMSASKTGKHGHAKVHLVGIDIFTGKKYEDICPSTHNMDVPNIKRNDFQLIGIQDGYLSLLQDSGEVPEDLRLPEGDLGKEIEQKYDCGEEILITVLSAMTEEAAVAIKAMAK,16760.36203369,16771.14588,,RESID:41@0|RESID:116@48,,,1
2519,IF5AL_HUMAN,Q6IS14,Eukaryotic translation initiation factor 5A-1-like,Q6IS14,,MADDLDFETGDAGASATFPMQCSALRKNGFVVLKGWPCKIVEMSASKTGKHGHAKVHLVGIDIFTGKKYEDICPSTHNMDVPNIKRNDFQLIGIQDGYLSLLQDSGEVPEDLRLPEGDLGKEIEQKYDCGEEILITVLSAMTEEAAVAIKAMAK,0,153,154,MADDLDFETGDAGASATFPMQCSALRKNGFVVLKGWPCKIVEMSASKTGKHGHAKVHLVGIDIFTGKKYEDICPSTHNMDVPNIKRNDFQLIGIQDGYLSLLQDSGEVPEDLRLPEGDLGKEIEQKYDCGEEILITVLSAMTEEAAVAIKAMAK,16804.33410969,16815.21848,,RESID:55@26,,,1
3487,IF5AL_HUMAN,Q6IS14,Eukaryotic translation initiation factor 5A-1-like,Q6IS14,,MADDLDFETGDAGASATFPMQCSALRKNGFVVLKGWPCKIVEMSASKTGKHGHAKVHLVGIDIFTGKKYEDICPSTHNMDVPNIKRNDFQLIGIQDGYLSLLQDSGEVPEDLRLPEGDLGKEIEQKYDCGEEILITVLSAMTEEAAVAIKAMAK,0,153,154,MADDLDFETGDAGASATFPMQCSALRKNGFVVLKGWPCKIVEMSASKTGKHGHAKVHLVGIDIFTGKKYEDICPSTHNMDVPNIKRNDFQLIGIQDGYLSLLQDSGEVPEDLRLPEGDLGKEIEQKYDCGEEILITVLSAMTEEAAVAIKAMAK,16804.33410969,16815.21848,,RESID:49@0,,,1
3979,IF5AL_HUMAN,Q6IS14,Eukaryotic translation initiation factor 5A-1-like,Q6IS14,,MADDLDFETGDAGASATFPMQCSALRKNGFVVLKGWPCKIVEMSASKTGKHGHAKVHLVGIDIFTGKKYEDICPSTHNMDVPNIKRNDFQLIGIQDGYLSLLQDSGEVPEDLRLPEGDLGKEIEQKYDCGEEILITVLSAMTEEAAVAIKAMAK,1,153,153,ADDLDFETGDAGASATFPMQCSALRKNGFVVLKGWPCKIVEMSASKTGKHGHAKVHLVGIDIFTGKKYEDICPSTHNMDVPNIKRNDFQLIGIQDGYLSLLQDSGEVPEDLRLPEGDLGKEIEQKYDCGEEILITVLSAMTEEAAVAIKAMAK,16760.36203369,16771.14588,,RESID:116@48|RESID:55@66,,,1
7383,IF5AL_HUMAN,Q6IS14,Eukaryotic translation initiation factor 5A-1-like,Q6IS14,,MADDLDFETGDAGASATFPMQCSALRKNGFVVLKGWPCKIVEMSASKTGKHGHAKVHLVGIDIFTGKKYEDICPSTHNMDVPNIKRNDFQLIGIQDGYLSLLQDSGEVPEDLRLPEGDLGKEIEQKYDCGEEILITVLSAMTEEAAVAIKAMAK,0,153,154,MADDLDFETGDAGASATFPMQCSALRKNGFVVLKGWPCKIVEMSASKTGKHGHAKVHLVGIDIFTGKKYEDICPSTHNMDVPNIKRNDFQLIGIQDGYLSLLQDSGEVPEDLRLPEGDLGKEIEQKYDCGEEILITVLSAMTEEAAVAIKAMAK,16975.42365369,16986.41848,,RESID:49@0|RESID:55@26|RESID:116@49|RESID:55@67,,,1
7476,IF5AL_HUMAN,Q6IS14,Eukaryotic translation initiation factor 5A-1-like,Q6IS14,,MADDLDFETGDAGASATFPMQCSALRKNGFVVLKGWPCKIVEMSASKTGKHGHAKVHLVGIDIFTGKKYEDICPSTHNMDVPNIKRNDFQLIGIQDGYLSLLQDSGEVPEDLRLPEGDLGKEIEQKYDCGEEILITVLSAMTEEAAVAIKAMAK,0,153,154,MADDLDFETGDAGASATFPMQCSALRKNGFVVLKGWPCKIVEMSASKTGKHGHAKVHLVGIDIFTGKKYEDICPSTHNMDVPNIKRNDFQLIGIQDGYLSLLQDSGEVPEDLRLPEGDLGKEIEQKYDCGEEILITVLSAMTEEAAVAIKAMAK,16891.40252369,16902.33848,,RESID:116@49|RESID:55@67,,,1
7939,IF5AL_HUMAN,Q6IS14,Eukaryotic translation initiation factor 5A-1-like,Q6IS14,,MADDLDFETGDAGASATFPMQCSALRKNGFVVLKGWPCKIVEMSASKTGKHGHAKVHLVGIDIFTGKKYEDICPSTHNMDVPNIKRNDFQLIGIQDGYLSLLQDSGEVPEDLRLPEGDLGKEIEQKYDCGEEILITVLSAMTEEAAVAIKAMAK,0,153,154,MADDLDFETGDAGASATFPMQCSALRKNGFVVLKGWPCKIVEMSASKTGKHGHAKVHLVGIDIFTGKKYEDICPSTHNMDVPNIKRNDFQLIGIQDGYLSLLQDSGEVPEDLRLPEGDLGKEIEQKYDCGEEILITVLSAMTEEAAVAIKAMAK,16888.35523969,16899.29848,,RESID:49@0|RESID:55@26|RESID:55@67,,,1
14841,IF5AL_HUMAN,Q6IS14,Eukaryotic translation initiation factor 5A-1-like,Q6IS14,,MADDLDFETGDAGASATFPMQCSALRKNGFVVLKGWPCKIVEMSASKTGKHGHAKVHLVGIDIFTGKKYEDICPSTHNMDVPNIKRNDFQLIGIQDGYLSLLQDSGEVPEDLRLPEGDLGKEIEQKYDCGEEILITVLSAMTEEAAVAIKAMAK,0,153,154,MADDLDFETGDAGASATFPMQCSALRKNGFVVLKGWPCKIVEMSASKTGKHGHAKVHLVGIDIFTGKKYEDICPSTHNMDVPNIKRNDFQLIGIQDGYLSLLQDSGEVPEDLRLPEGDLGKEIEQKYDCGEEILITVLSAMTEEAAVAIKAMAK,16891.40252369,16902.33848,,RESID:49@0|RESID:116@49,,,1
