PFR,UniProt Id,Entry Accession,Entry Description,Isoform Accession,Isoform Description,Isoform Sequence,Start,End,Length,Proteoform Sequence,Monoisotopic Mass,Average Mass,Sequence Modifications,PTMs,N-Terminal,C-Terminal,Star
2221,H3C_HUMAN,Q6NXT2,Histone H3.3C,Q6NXT2,,MARTKQTARKSTGGKAPRKQLATKAARKSTPSTCGVKPHRYRPGTVALREIRRYQKSTELLIRKLPFQRLVREIAQDFNTDLRFQSAAVGALQEASEAYLVGLLEDTNLCAIHAKRVTIMPKDIQLARRIRGERA,0,134,135,MARTKQTARKSTGGKAPRKQLATKAARKSTPSTCGVKPHRYRPGTVALREIRRYQKSTELLIRKLPFQRLVREIAQDFNTDLRFQSAAVGALQEASEAYLVGLLEDTNLCAIHAKRVTIMPKDIQLARRIRGERA,15884.28020969,15893.92628,,RESID:49@0|RESID:38@3|RESID:38@6|RESID:67@8|RESID:55@9|RESID:37@10|RESID:38@11|RESID:55@14|RESID:55@18|RESID:55@23|RESID:55@27|RESID:37@28,,,1
2742,H3C_HUMAN,Q6NXT2,Histone H3.3C,Q6NXT2,,MARTKQTARKSTGGKAPRKQLATKAARKSTPSTCGVKPHRYRPGTVALREIRRYQKSTELLIRKLPFQRLVREIAQDFNTDLRFQSAAVGALQEASEAYLVGLLEDTNLCAIHAKRVTIMPKDIQLARRIRGERA,0,134,135,MARTKQTARKSTGGKAPRKQLATKAARKSTPSTCGVKPHRYRPGTVALREIRRYQKSTELLIRKLPFQRLVREIAQDFNTDLRFQSAAVGALQEASEAYLVGLLEDTNLCAIHAKRVTIMPKDIQLARRIRGERA,15814.23834469,15823.83628,,RESID:49@0|RESID:38@3|RESID:38@6|RESID:55@9|RESID:37@10|RESID:38@11|RESID:55@14|RESID:55@18|RESID:55@23|RESID:37@28,,,1
3352,H3C_HUMAN,Q6NXT2,Histone H3.3C,Q6NXT2,,MARTKQTARKSTGGKAPRKQLATKAARKSTPSTCGVKPHRYRPGTVALREIRRYQKSTELLIRKLPFQRLVREIAQDFNTDLRFQSAAVGALQEASEAYLVGLLEDTNLCAIHAKRVTIMPKDIQLARRIRGERA,1,134,134,ARTKQTARKSTGGKAPRKQLATKAARKSTPSTCGVKPHRYRPGTVALREIRRYQKSTELLIRKLPFQRLVREIAQDFNTDLRFQSAAVGALQEASEAYLVGLLEDTNLCAIHAKRVTIMPKDIQLARRIRGERA,15073.31337469,15082.54368,,,,,1
4056,H3C_HUMAN,Q6NXT2,Histone H3.3C,Q6NXT2,,MARTKQTARKSTGGKAPRKQLATKAARKSTPSTCGVKPHRYRPGTVALREIRRYQKSTELLIRKLPFQRLVREIAQDFNTDLRFQSAAVGALQEASEAYLVGLLEDTNLCAIHAKRVTIMPKDIQLARRIRGERA,1,134,134,ARTKQTARKSTGGKAPRKQLATKAARKSTPSTCGVKPHRYRPGTVALREIRRYQKSTELLIRKLPFQRLVREIAQDFNTDLRFQSAAVGALQEASEAYLVGLLEDTNLCAIHAKRVTIMPKDIQLARRIRGERA,15115.32393969,15124.58368,,RESID:41@0,,,1
7377,H3C_HUMAN,Q6NXT2,Histone H3.3C,Q6NXT2,,MARTKQTARKSTGGKAPRKQLATKAARKSTPSTCGVKPHRYRPGTVALREIRRYQKSTELLIRKLPFQRLVREIAQDFNTDLRFQSAAVGALQEASEAYLVGLLEDTNLCAIHAKRVTIMPKDIQLARRIRGERA,0,134,135,MARTKQTARKSTGGKAPRKQLATKAARKSTPSTCGVKPHRYRPGTVALREIRRYQKSTELLIRKLPFQRLVREIAQDFNTDLRFQSAAVGALQEASEAYLVGLLEDTNLCAIHAKRVTIMPKDIQLARRIRGERA,15288.37499469,15297.81628,,RESID:55@14|RESID:55@18,,,1
7428,H3C_HUMAN,Q6NXT2,Histone H3.3C,Q6NXT2,,MARTKQTARKSTGGKAPRKQLATKAARKSTPSTCGVKPHRYRPGTVALREIRRYQKSTELLIRKLPFQRLVREIAQDFNTDLRFQSAAVGALQEASEAYLVGLLEDTNLCAIHAKRVTIMPKDIQLARRIRGERA,1,134,134,ARTKQTARKSTGGKAPRKQLATKAARKSTPSTCGVKPHRYRPGTVALREIRRYQKSTELLIRKLPFQRLVREIAQDFNTDLRFQSAAVGALQEASEAYLVGLLEDTNLCAIHAKRVTIMPKDIQLARRIRGERA,15115.32393969,15124.58368,,RESID:55@8,,,1
7455,H3C_HUMAN,Q6NXT2,Histone H3.3C,Q6NXT2,,MARTKQTARKSTGGKAPRKQLATKAARKSTPSTCGVKPHRYRPGTVALREIRRYQKSTELLIRKLPFQRLVREIAQDFNTDLRFQSAAVGALQEASEAYLVGLLEDTNLCAIHAKRVTIMPKDIQLARRIRGERA,0,134,135,MARTKQTARKSTGGKAPRKQLATKAARKSTPSTCGVKPHRYRPGTVALREIRRYQKSTELLIRKLPFQRLVREIAQDFNTDLRFQSAAVGALQEASEAYLVGLLEDTNLCAIHAKRVTIMPKDIQLARRIRGERA,15204.35386469,15213.73628,,,,,1
7470,H3C_HUMAN,Q6NXT2,Histone H3.3C,Q6NXT2,,MARTKQTARKSTGGKAPRKQLATKAARKSTPSTCGVKPHRYRPGTVALREIRRYQKSTELLIRKLPFQRLVREIAQDFNTDLRFQSAAVGALQEASEAYLVGLLEDTNLCAIHAKRVTIMPKDIQLARRIRGERA,1,134,134,ARTKQTARKSTGGKAPRKQLATKAARKSTPSTCGVKPHRYRPGTVALREIRRYQKSTELLIRKLPFQRLVREIAQDFNTDLRFQSAAVGALQEASEAYLVGLLEDTNLCAIHAKRVTIMPKDIQLARRIRGERA,15143.35523969,15152.63368,,RESID:41@0|RESID:67@7,,,1
7704,H3C_HUMAN,Q6NXT2,Histone H3.3C,Q6NXT2,,MARTKQTARKSTGGKAPRKQLATKAARKSTPSTCGVKPHRYRPGTVALREIRRYQKSTELLIRKLPFQRLVREIAQDFNTDLRFQSAAVGALQEASEAYLVGLLEDTNLCAIHAKRVTIMPKDIQLARRIRGERA,0,134,135,MARTKQTARKSTGGKAPRKQLATKAARKSTPSTCGVKPHRYRPGTVALREIRRYQKSTELLIRKLPFQRLVREIAQDFNTDLRFQSAAVGALQEASEAYLVGLLEDTNLCAIHAKRVTIMPKDIQLARRIRGERA,15246.36442969,15255.77628,,RESID:49@0,,,1
7834,H3C_HUMAN,Q6NXT2,Histone H3.3C,Q6NXT2,,MARTKQTARKSTGGKAPRKQLATKAARKSTPSTCGVKPHRYRPGTVALREIRRYQKSTELLIRKLPFQRLVREIAQDFNTDLRFQSAAVGALQEASEAYLVGLLEDTNLCAIHAKRVTIMPKDIQLARRIRGERA,1,134,134,ARTKQTARKSTGGKAPRKQLATKAARKSTPSTCGVKPHRYRPGTVALREIRRYQKSTELLIRKLPFQRLVREIAQDFNTDLRFQSAAVGALQEASEAYLVGLLEDTNLCAIHAKRVTIMPKDIQLARRIRGERA,15153.27970569,15162.52368,,RESID:37@27,,,1
7842,H3C_HUMAN,Q6NXT2,Histone H3.3C,Q6NXT2,,MARTKQTARKSTGGKAPRKQLATKAARKSTPSTCGVKPHRYRPGTVALREIRRYQKSTELLIRKLPFQRLVREIAQDFNTDLRFQSAAVGALQEASEAYLVGLLEDTNLCAIHAKRVTIMPKDIQLARRIRGERA,1,134,134,ARTKQTARKSTGGKAPRKQLATKAARKSTPSTCGVKPHRYRPGTVALREIRRYQKSTELLIRKLPFQRLVREIAQDFNTDLRFQSAAVGALQEASEAYLVGLLEDTNLCAIHAKRVTIMPKDIQLARRIRGERA,15223.32157069,15232.61368,,RESID:67@7|RESID:37@9|RESID:55@26,,,1
7986,H3C_HUMAN,Q6NXT2,Histone H3.3C,Q6NXT2,,MARTKQTARKSTGGKAPRKQLATKAARKSTPSTCGVKPHRYRPGTVALREIRRYQKSTELLIRKLPFQRLVREIAQDFNTDLRFQSAAVGALQEASEAYLVGLLEDTNLCAIHAKRVTIMPKDIQLARRIRGERA,1,134,134,ARTKQTARKSTGGKAPRKQLATKAARKSTPSTCGVKPHRYRPGTVALREIRRYQKSTELLIRKLPFQRLVREIAQDFNTDLRFQSAAVGALQEASEAYLVGLLEDTNLCAIHAKRVTIMPKDIQLARRIRGERA,15223.32157069,15232.61368,,RESID:38@2|RESID:67@7|RESID:55@26,,,1
8247,H3C_HUMAN,Q6NXT2,Histone H3.3C,Q6NXT2,,MARTKQTARKSTGGKAPRKQLATKAARKSTPSTCGVKPHRYRPGTVALREIRRYQKSTELLIRKLPFQRLVREIAQDFNTDLRFQSAAVGALQEASEAYLVGLLEDTNLCAIHAKRVTIMPKDIQLARRIRGERA,1,134,134,ARTKQTARKSTGGKAPRKQLATKAARKSTPSTCGVKPHRYRPGTVALREIRRYQKSTELLIRKLPFQRLVREIAQDFNTDLRFQSAAVGALQEASEAYLVGLLEDTNLCAIHAKRVTIMPKDIQLARRIRGERA,15157.33450469,15166.62368,,RESID:55@17|RESID:55@26,,,1
8369,H3C_HUMAN,Q6NXT2,Histone H3.3C,Q6NXT2,,MARTKQTARKSTGGKAPRKQLATKAARKSTPSTCGVKPHRYRPGTVALREIRRYQKSTELLIRKLPFQRLVREIAQDFNTDLRFQSAAVGALQEASEAYLVGLLEDTNLCAIHAKRVTIMPKDIQLARRIRGERA,1,134,134,ARTKQTARKSTGGKAPRKQLATKAARKSTPSTCGVKPHRYRPGTVALREIRRYQKSTELLIRKLPFQRLVREIAQDFNTDLRFQSAAVGALQEASEAYLVGLLEDTNLCAIHAKRVTIMPKDIQLARRIRGERA,15265.33213569,15274.65368,,RESID:41@0|RESID:67@7|RESID:55@22|RESID:37@27,,,1
8398,H3C_HUMAN,Q6NXT2,Histone H3.3C,Q6NXT2,,MARTKQTARKSTGGKAPRKQLATKAARKSTPSTCGVKPHRYRPGTVALREIRRYQKSTELLIRKLPFQRLVREIAQDFNTDLRFQSAAVGALQEASEAYLVGLLEDTNLCAIHAKRVTIMPKDIQLARRIRGERA,1,134,134,ARTKQTARKSTGGKAPRKQLATKAARKSTPSTCGVKPHRYRPGTVALREIRRYQKSTELLIRKLPFQRLVREIAQDFNTDLRFQSAAVGALQEASEAYLVGLLEDTNLCAIHAKRVTIMPKDIQLARRIRGERA,15195.29027069,15204.56368,,RESID:55@8|RESID:37@27,,,1
8636,H3C_HUMAN,Q6NXT2,Histone H3.3C,Q6NXT2,,MARTKQTARKSTGGKAPRKQLATKAARKSTPSTCGVKPHRYRPGTVALREIRRYQKSTELLIRKLPFQRLVREIAQDFNTDLRFQSAAVGALQEASEAYLVGLLEDTNLCAIHAKRVTIMPKDIQLARRIRGERA,0,134,135,MARTKQTARKSTGGKAPRKQLATKAARKSTPSTCGVKPHRYRPGTVALREIRRYQKSTELLIRKLPFQRLVREIAQDFNTDLRFQSAAVGALQEASEAYLVGLLEDTNLCAIHAKRVTIMPKDIQLARRIRGERA,15452.36245569,15461.87628,,RESID:49@0|RESID:55@9|RESID:55@18|RESID:55@23|RESID:37@28,,,1
13080,H3C_HUMAN,Q6NXT2,Histone H3.3C,Q6NXT2,,MARTKQTARKSTGGKAPRKQLATKAARKSTPSTCGVKPHRYRPGTVALREIRRYQKSTELLIRKLPFQRLVREIAQDFNTDLRFQSAAVGALQEASEAYLVGLLEDTNLCAIHAKRVTIMPKDIQLARRIRGERA,1,134,134,ARTKQTARKSTGGKAPRKQLATKAARKSTPSTCGVKPHRYRPGTVALREIRRYQKSTELLIRKLPFQRLVREIAQDFNTDLRFQSAAVGALQEASEAYLVGLLEDTNLCAIHAKRVTIMPKDIQLARRIRGERA,15167.29535569,15176.55368,,RESID:38@2|RESID:76@3,,,1
13111,H3C_HUMAN,Q6NXT2,Histone H3.3C,Q6NXT2,,MARTKQTARKSTGGKAPRKQLATKAARKSTPSTCGVKPHRYRPGTVALREIRRYQKSTELLIRKLPFQRLVREIAQDFNTDLRFQSAAVGALQEASEAYLVGLLEDTNLCAIHAKRVTIMPKDIQLARRIRGERA,1,134,134,ARTKQTARKSTGGKAPRKQLATKAARKSTPSTCGVKPHRYRPGTVALREIRRYQKSTELLIRKLPFQRLVREIAQDFNTDLRFQSAAVGALQEASEAYLVGLLEDTNLCAIHAKRVTIMPKDIQLARRIRGERA,15317.26716669,15326.58368,,RESID:41@0|RESID:38@2|RESID:55@3|RESID:38@5,,,1
13114,H3C_HUMAN,Q6NXT2,Histone H3.3C,Q6NXT2,,MARTKQTARKSTGGKAPRKQLATKAARKSTPSTCGVKPHRYRPGTVALREIRRYQKSTELLIRKLPFQRLVREIAQDFNTDLRFQSAAVGALQEASEAYLVGLLEDTNLCAIHAKRVTIMPKDIQLARRIRGERA,0,134,135,MARTKQTARKSTGGKAPRKQLATKAARKSTPSTCGVKPRRYRPGTVALREIRRYQKSTELLIRKLPFQRLVREIAQDFNTDLRFQSAAVGALQEASEAYLVGLLEDTNLCAIHAKRVTIMPKDIQLARRIRGERA,15331.39369569,15340.81268,PSI-MOD:11@38,RESID:38@3|RESID:75@4,,,1
13136,H3C_HUMAN,Q6NXT2,Histone H3.3C,Q6NXT2,,MARTKQTARKSTGGKAPRKQLATKAARKSTPSTCGVKPHRYRPGTVALREIRRYQKSTELLIRKLPFQRLVREIAQDFNTDLRFQSAAVGALQEASEAYLVGLLEDTNLCAIHAKRVTIMPKDIQLARRIRGERA,1,134,134,ARTKQTARKSTGGKAPRKQLATKAARKSTPSTCGVKPHRYRPGTVALREIRRYQKSTELLIRKLPFQRLVREIAQDFNTDLRFQSAAVGALQEASEAYLVGLLEDTNLCAIHAKRVTIMPKDIQLARRIRGERA,15303.28790169,15312.59368,,RESID:41@0|RESID:38@2|RESID:75@3|RESID:38@5,,,1
13195,H3C_HUMAN,Q6NXT2,Histone H3.3C,Q6NXT2,,MARTKQTARKSTGGKAPRKQLATKAARKSTPSTCGVKPHRYRPGTVALREIRRYQKSTELLIRKLPFQRLVREIAQDFNTDLRFQSAAVGALQEASEAYLVGLLEDTNLCAIHAKRVTIMPKDIQLARRIRGERA,1,134,134,ARTKQTARKSTGGKAPRKQLATKAARKSTPSTCGVKPHRYRPGTVALREIRRYQKSTELLIRKLPFQRLVREIAQDFNTDLRFQSAAVGALQEASEAYLVGLLEDTNLCAIHAKRVTIMPKDIQLARRIRGERA,15101.34467469,15110.59368,,RESID:75@8,,,1
13200,H3C_HUMAN,Q6NXT2,Histone H3.3C,Q6NXT2,,MARTKQTARKSTGGKAPRKQLATKAARKSTPSTCGVKPHRYRPGTVALREIRRYQKSTELLIRKLPFQRLVREIAQDFNTDLRFQSAAVGALQEASEAYLVGLLEDTNLCAIHAKRVTIMPKDIQLARRIRGERA,1,134,134,ARTKQTARKSTGGKAPRKQLATKAARKSTPSTCGVKPRRYRPGTVALREIRRYQKSTELLIRKLPFQRLVREIAQDFNTDLRFQSAAVGALQEASEAYLVGLLEDTNLCAIHAKRVTIMPKDIQLARRIRGERA,15106.37122469,15115.62008,PSI-MOD:11@38,RESID:76@22,,,1
13204,H3C_HUMAN,Q6NXT2,Histone H3.3C,Q6NXT2,,MARTKQTARKSTGGKAPRKQLATKAARKSTPSTCGVKPHRYRPGTVALREIRRYQKSTELLIRKLPFQRLVREIAQDFNTDLRFQSAAVGALQEASEAYLVGLLEDTNLCAIHAKRVTIMPKDIQLARRIRGERA,0,134,135,MARTKQTARKSTGGKAPRKQLATKAARKSTPSTCGVKPRRYRPGTVALREIRRYQKSTELLIRKLPFQRLVREIAQDFNTDLRFQSAAVGALQEASEAYLVGLLEDTNLCAIHAKRVTIMPKDIQLARRIRGERA,15345.40934631,15354.84540362,PSI-MOD:11@38,RESID:74@4|RESID:38@6,,,1
13212,H3C_HUMAN,Q6NXT2,Histone H3.3C,Q6NXT2,,MARTKQTARKSTGGKAPRKQLATKAARKSTPSTCGVKPHRYRPGTVALREIRRYQKSTELLIRKLPFQRLVREIAQDFNTDLRFQSAAVGALQEASEAYLVGLLEDTNLCAIHAKRVTIMPKDIQLARRIRGERA,0,134,135,MARTKQTARKSTGGKAPRKQLATKAARKSTPSTCGVKPRRYRPGTVALREIRRYQKSTELLIRKLPFQRLVREIAQDFNTDLRFQSAAVGALQEASEAYLVGLLEDTNLCAIHAKRVTIMPKDIQLARRIRGERA,15331.39369569,15340.81268,PSI-MOD:11@38,RESID:75@4|RESID:38@6,,,1
13236,H3C_HUMAN,Q6NXT2,Histone H3.3C,Q6NXT2,,MARTKQTARKSTGGKAPRKQLATKAARKSTPSTCGVKPHRYRPGTVALREIRRYQKSTELLIRKLPFQRLVREIAQDFNTDLRFQSAAVGALQEASEAYLVGLLEDTNLCAIHAKRVTIMPKDIQLARRIRGERA,1,134,134,ARTKQTARKSTGGKAPRKQLATKAARKSTPSTCGVKPHRYRPGTVALREIRRYQKSTELLIRKLPFQRLVREIAQDFNTDLRFQSAAVGALQEASEAYLVGLLEDTNLCAIHAKRVTIMPKDIQLARRIRGERA,15101.34467469,15110.59368,,RESID:67@7,,,1
13374,H3C_HUMAN,Q6NXT2,Histone H3.3C,Q6NXT2,,MARTKQTARKSTGGKAPRKQLATKAARKSTPSTCGVKPHRYRPGTVALREIRRYQKSTELLIRKLPFQRLVREIAQDFNTDLRFQSAAVGALQEASEAYLVGLLEDTNLCAIHAKRVTIMPKDIQLARRIRGERA,1,134,134,ARTKQTARKSTGGKAPRKQLATKAARKSTPSTCGVKPRRYRPGTVALREIRRYQKSTELLIRKLPFQRLVREIAQDFNTDLRFQSAAVGALQEASEAYLVGLLEDTNLCAIHAKRVTIMPKDIQLARRIRGERA,15120.38687469,15129.64008,PSI-MOD:11@38,RESID:75@3,,,1
13993,H3C_HUMAN,Q6NXT2,Histone H3.3C,Q6NXT2,,MARTKQTARKSTGGKAPRKQLATKAARKSTPSTCGVKPHRYRPGTVALREIRRYQKSTELLIRKLPFQRLVREIAQDFNTDLRFQSAAVGALQEASEAYLVGLLEDTNLCAIHAKRVTIMPKDIQLARRIRGERA,1,134,134,ARTKQTARKSTGGKAPRKQLATKAARKSTPSTCGVKPRRYRPGTVALREIRRYQKSTELLIRKLPFQRLVREIAQDFNTDLRFQSAAVGALQEASEAYLVGLLEDTNLCAIHAKRVTIMPKDIQLARRIRGERA,15172.32190569,15181.57008,PSI-MOD:11@38,RESID:37@27,,,1
14831,H3C_HUMAN,Q6NXT2,Histone H3.3C,Q6NXT2,,MARTKQTARKSTGGKAPRKQLATKAARKSTPSTCGVKPHRYRPGTVALREIRRYQKSTELLIRKLPFQRLVREIAQDFNTDLRFQSAAVGALQEASEAYLVGLLEDTNLCAIHAKRVTIMPKDIQLARRIRGERA,1,134,134,ARTKQTARKSTGGKAPRKQLATKAARKSTPSTCGVKPHRYRPGTVALREIRRYQKSTELLIRKLPFQRLVREIAQDFNTDLRFQSAAVGALQEASEAYLVGLLEDTNLCAIHAKRVTIMPKDIQLARRIRGERA,15115.36032531,15124.62640362,,RESID:74@3,,,1
14853,H3C_HUMAN,Q6NXT2,Histone H3.3C,Q6NXT2,,MARTKQTARKSTGGKAPRKQLATKAARKSTPSTCGVKPHRYRPGTVALREIRRYQKSTELLIRKLPFQRLVREIAQDFNTDLRFQSAAVGALQEASEAYLVGLLEDTNLCAIHAKRVTIMPKDIQLARRIRGERA,1,134,134,ARTKQTARKSTGGKAPRKQLATKAARKSTPSTCGVKPRRYRPGTVALREIRRYQKSTELLIRKLPFQRLVREIAQDFNTDLRFQSAAVGALQEASEAYLVGLLEDTNLCAIHAKRVTIMPKDIQLARRIRGERA,15134.36613969,15143.63008,PSI-MOD:11@38,RESID:55@3,,,1
14859,H3C_HUMAN,Q6NXT2,Histone H3.3C,Q6NXT2,,MARTKQTARKSTGGKAPRKQLATKAARKSTPSTCGVKPHRYRPGTVALREIRRYQKSTELLIRKLPFQRLVREIAQDFNTDLRFQSAAVGALQEASEAYLVGLLEDTNLCAIHAKRVTIMPKDIQLARRIRGERA,1,134,134,ARTKQTARKSTGGKAPRKQLATKAARKSTPSTCGVKPRRYRPGTVALREIRRYQKSTELLIRKLPFQRLVREIAQDFNTDLRFQSAAVGALQEASEAYLVGLLEDTNLCAIHAKRVTIMPKDIQLARRIRGERA,15242.36377069,15251.66008,PSI-MOD:11@38,RESID:41@0|RESID:75@3|RESID:38@5,,,1
14861,H3C_HUMAN,Q6NXT2,Histone H3.3C,Q6NXT2,,MARTKQTARKSTGGKAPRKQLATKAARKSTPSTCGVKPHRYRPGTVALREIRRYQKSTELLIRKLPFQRLVREIAQDFNTDLRFQSAAVGALQEASEAYLVGLLEDTNLCAIHAKRVTIMPKDIQLARRIRGERA,1,134,134,ARTKQTARKSTGGKAPRKQLATKAARKSTPSTCGVKPHRYRPGTVALREIRRYQKSTELLIRKLPFQRLVREIAQDFNTDLRFQSAAVGALQEASEAYLVGLLEDTNLCAIHAKRVTIMPKDIQLARRIRGERA,15157.37089031,15166.66640362,,RESID:41@0|RESID:74@3,,,1
14869,H3C_HUMAN,Q6NXT2,Histone H3.3C,Q6NXT2,,MARTKQTARKSTGGKAPRKQLATKAARKSTPSTCGVKPHRYRPGTVALREIRRYQKSTELLIRKLPFQRLVREIAQDFNTDLRFQSAAVGALQEASEAYLVGLLEDTNLCAIHAKRVTIMPKDIQLARRIRGERA,1,134,134,ARTKQTARKSTGGKAPRKQLATKAARKSTPSTCGVKPRRYRPGTVALREIRRYQKSTELLIRKLPFQRLVREIAQDFNTDLRFQSAAVGALQEASEAYLVGLLEDTNLCAIHAKRVTIMPKDIQLARRIRGERA,15172.32190569,15181.57008,PSI-MOD:11@38,RESID:37@9,,,1
14872,H3C_HUMAN,Q6NXT2,Histone H3.3C,Q6NXT2,,MARTKQTARKSTGGKAPRKQLATKAARKSTPSTCGVKPHRYRPGTVALREIRRYQKSTELLIRKLPFQRLVREIAQDFNTDLRFQSAAVGALQEASEAYLVGLLEDTNLCAIHAKRVTIMPKDIQLARRIRGERA,0,134,135,MARTKQTARKSTGGKAPRKQLATKAARKSTPSTCGVKPRRYRPGTVALREIRRYQKSTELLIRKLPFQRLVREIAQDFNTDLRFQSAAVGALQEASEAYLVGLLEDTNLCAIHAKRVTIMPKDIQLARRIRGERA,15293.43792969,15302.87268,PSI-MOD:11@38,RESID:49@0|RESID:75@4,,,1
14881,H3C_HUMAN,Q6NXT2,Histone H3.3C,Q6NXT2,,MARTKQTARKSTGGKAPRKQLATKAARKSTPSTCGVKPHRYRPGTVALREIRRYQKSTELLIRKLPFQRLVREIAQDFNTDLRFQSAAVGALQEASEAYLVGLLEDTNLCAIHAKRVTIMPKDIQLARRIRGERA,1,134,134,ARTKQTARKSTGGKAPRKQLATKAARKSTPSTCGVKPHRYRPGTVALREIRRYQKSTELLIRKLPFQRLVREIAQDFNTDLRFQSAAVGALQEASEAYLVGLLEDTNLCAIHAKRVTIMPKDIQLARRIRGERA,15087.32902469,15096.57368,,RESID:76@3,,,1
16298,H3C_HUMAN,Q6NXT2,Histone H3.3C,Q6NXT2,,MARTKQTARKSTGGKAPRKQLATKAARKSTPSTCGVKPHRYRPGTVALREIRRYQKSTELLIRKLPFQRLVREIAQDFNTDLRFQSAAVGALQEASEAYLVGLLEDTNLCAIHAKRVTIMPKDIQLARRIRGERA,1,134,134,ARTKQTARKSTGGKAPRKQLATKAARKSTPSTCGVKPHRYRPGTVALREIRRYQKSTELLIRKLPFQRLVREIAQDFNTDLRFQSAAVGALQEASEAYLVGLLEDTNLCAIHAKRVTIMPKDIQLARRIRGERA,15116.26034,15125.51368,,RESID:214@1|RESID:121@3|RESID:214@7,PSI-MOD:1458,,0
16613,H3C_HUMAN,Q6NXT2,Histone H3.3C,Q6NXT2,,MARTKQTARKSTGGKAPRKQLATKAARKSTPSTCGVKPHRYRPGTVALREIRRYQKSTELLIRKLPFQRLVREIAQDFNTDLRFQSAAVGALQEASEAYLVGLLEDTNLCAIHAKRVTIMPKDIQLARRIRGERA,1,134,134,ARTKQTARKSTGGKAPRKQLATKAARKSTPSTCGVKPHRYRPGTVALREIRRYQKSTELLIRKLPFQRLVREIAQDFNTDLRFQSAAVGALQEASEAYLVGLLEDTNLCAIHAKRVTIMPKDIQLARRIRGERA,15131.30762,15140.57368,,RESID:214@1|RESID:76@3|RESID:214@7,PSI-MOD:1458,,0
17519,H3C_HUMAN,Q6NXT2,Histone H3.3C,Q6NXT2,,MARTKQTARKSTGGKAPRKQLATKAARKSTPSTCGVKPHRYRPGTVALREIRRYQKSTELLIRKLPFQRLVREIAQDFNTDLRFQSAAVGALQEASEAYLVGLLEDTNLCAIHAKRVTIMPKDIQLARRIRGERA,1,134,134,ARTKQTARKSTGGKAPRKQLATKAARKSTPSTCGVKPHRYRPGTVALREIRRYQKSTELLIRKLPFQRLVREIAQDFNTDLRFQSAAVGALQEASEAYLVGLLEDTNLCAIHAKRVTIMPKDIQLARRIRGERA,15116.30796,15125.56368,,RESID:55@3|RESID:214@7,,,0
19600,H3C_HUMAN,Q6NXT2,Histone H3.3C,Q6NXT2,,MARTKQTARKSTGGKAPRKQLATKAARKSTPSTCGVKPHRYRPGTVALREIRRYQKSTELLIRKLPFQRLVREIAQDFNTDLRFQSAAVGALQEASEAYLVGLLEDTNLCAIHAKRVTIMPKDIQLARRIRGERA,1,134,134,ARTKQTARKSTGGKAPRKQLATKAARKSTPSTCGVKPHRYRPGTVALREIRRYQKSTELLIRKLPFQRLVREIAQDFNTDLRFQSAAVGALQEASEAYLVGLLEDTNLCAIHAKRVTIMPKDIQLARRIRGERA,15114.29230569,15123.55368,,RESID:121@3,PSI-MOD:1458,,0
73285,H3C_HUMAN,Q6NXT2,Histone H3.3C,Q6NXT2,,MARTKQTARKSTGGKAPRKQLATKAARKSTPSTCGVKPHRYRPGTVALREIRRYQKSTELLIRKLPFQRLVREIAQDFNTDLRFQSAAVGALQEASEAYLVGLLEDTNLCAIHAKRVTIMPKDIQLARRIRGERA,97,134,38,AYLVGLLEDTNLCAIHAKRVTIMPKDIQLARRIRGERA,4303.38847469,4306.11668,,,,,1
