PFR,UniProt Id,Entry Accession,Entry Description,Isoform Accession,Isoform Description,Isoform Sequence,Start,End,Length,Proteoform Sequence,Monoisotopic Mass,Average Mass,Sequence Modifications,PTMs,N-Terminal,C-Terminal,Star
2764,SZRD1_HUMAN,Q7Z422,SUZ domain-containing protein 1,Q7Z422-1,1,MEDEEVAESWEEAADSGEIDRRLEKKLKITQKESRKSKSPPKVPIVIQDDSLPAGPPPQIRILKRPTSNGVVSSPNSTSRPTLPVKSLAQREAEYAEARKRILGSASPEEEQEKPILDRPTRISQPEDSRQPNNVIRQPLGPDGSQGFKQRR,1,151,151,EDEEVAESWEEAADSGEIDRRLEKKLKITQKESRKSKSPPKVPIVIQDDSLPAGPPPQIRILKRPTSNGVVSSPNSTSRPTLPVKSLAQREAEYAEARKRILGSASPEEEQEKPILDRPTRISQPEDSRQPNNVIRQPLGPDGSQGFKQRR,16935.83399569,16945.84208,,RESID:37@35,,,1
2779,SZRD1_HUMAN,Q7Z422,SUZ domain-containing protein 1,Q7Z422-1,1,MEDEEVAESWEEAADSGEIDRRLEKKLKITQKESRKSKSPPKVPIVIQDDSLPAGPPPQIRILKRPTSNGVVSSPNSTSRPTLPVKSLAQREAEYAEARKRILGSASPEEEQEKPILDRPTRISQPEDSRQPNNVIRQPLGPDGSQGFKQRR,1,151,151,EDEEVAESWEEAADSGEIDRRLEKKLKITQKESRKSKSPPKVPIVIQDDSLPAGPPPQIRILKRPTSNGVVSSPNSTSRPTLPVKSLAQREAEYAEARKRILGSASPEEEQEKPILDRPTRISQPEDSRQPNNVIRQPLGPDGSQGFKQRR,16855.86766469,16865.86208,,,,,1
2993,SZRD1_HUMAN,Q7Z422,SUZ domain-containing protein 1,Q7Z422-1,1,MEDEEVAESWEEAADSGEIDRRLEKKLKITQKESRKSKSPPKVPIVIQDDSLPAGPPPQIRILKRPTSNGVVSSPNSTSRPTLPVKSLAQREAEYAEARKRILGSASPEEEQEKPILDRPTRISQPEDSRQPNNVIRQPLGPDGSQGFKQRR,0,151,152,MEDEEVAESWEEAADSGEIDRRLEKKLKITQKESRKSKSPPKVPIVIQDDSLPAGPPPQIRILKRPTSNGVVSSPNSTSRPTLPVKSLAQREAEYAEARKRILGSASPEEEQEKPILDRPTRISQPEDSRQPNNVIRQPLGPDGSQGFKQRR,17108.88505069,17119.07468,,RESID:49@0|RESID:37@36,,,1
5490,SZRD1_HUMAN,Q7Z422,SUZ domain-containing protein 1,Q7Z422-1,1,MEDEEVAESWEEAADSGEIDRRLEKKLKITQKESRKSKSPPKVPIVIQDDSLPAGPPPQIRILKRPTSNGVVSSPNSTSRPTLPVKSLAQREAEYAEARKRILGSASPEEEQEKPILDRPTRISQPEDSRQPNNVIRQPLGPDGSQGFKQRR,0,151,152,MEDEEVAESWEEAADSGEIDRRLEKKLKITQKESRKSKSPPKVPIVIQDDSLPAGPPPQIRILKRPTSNGVVSSPNSTSRPTLPVKSLAQREAEYAEARKRILGSASPEEEQEKPILDRPTRISQPEDSRQPNNVIRQPLGPDGSQGFKQRR,17188.85138169,17199.05468,,RESID:49@0|RESID:37@36|RESID:37@38,,,1
13395,SZRD1_HUMAN,Q7Z422,SUZ domain-containing protein 1,Q7Z422-1,1,MEDEEVAESWEEAADSGEIDRRLEKKLKITQKESRKSKSPPKVPIVIQDDSLPAGPPPQIRILKRPTSNGVVSSPNSTSRPTLPVKSLAQREAEYAEARKRILGSASPEEEQEKPILDRPTRISQPEDSRQPNNVIRQPLGPDGSQGFKQRR,0,151,152,MEDEEVAESWEEAADSGEIDRRLEKKLKITQKESRKSKSPPKVPIVIQDDSLPAGPPPQIRILKRPTSNGVVSSPNSTSRPTLPVKSLAQREAEYAEARKRILGSASPEEEQEKPILDRPTRISQPEDSRQPNNVIRQPLGPDGSQGFKQRR,17028.91871969,17039.09468,,RESID:49@0,,,1
13753,SZRD1_HUMAN,Q7Z422,SUZ domain-containing protein 1,Q7Z422-1,1,MEDEEVAESWEEAADSGEIDRRLEKKLKITQKESRKSKSPPKVPIVIQDDSLPAGPPPQIRILKRPTSNGVVSSPNSTSRPTLPVKSLAQREAEYAEARKRILGSASPEEEQEKPILDRPTRISQPEDSRQPNNVIRQPLGPDGSQGFKQRR,0,151,152,MEDEEVAESWEEAADSGEIDRRLEKKLKITQKESRKSKSPPKVPIVIQDDSLPAGPPPQIRILKRPTSNGVVSSPNSTSRPTLPVKSLAQREAEYAEARKRILGSASPEEEQEKPILDRPTRISQPEDSRQPNNVIRQPLGPDGSQGFKQRR,17108.88505069,17119.07468,,RESID:49@0|RESID:37@50,,,1
13754,SZRD1_HUMAN,Q7Z422,SUZ domain-containing protein 1,Q7Z422-1,1,MEDEEVAESWEEAADSGEIDRRLEKKLKITQKESRKSKSPPKVPIVIQDDSLPAGPPPQIRILKRPTSNGVVSSPNSTSRPTLPVKSLAQREAEYAEARKRILGSASPEEEQEKPILDRPTRISQPEDSRQPNNVIRQPLGPDGSQGFKQRR,0,151,152,MEDEEVAESWEEAADSGEIDRRLEKKLKITQKESRKSKSPPKVPIVIQDDSLPAGPPPQIRILKRPTSNGVVSSPNSTSRPTLPVKSLAQREAEYAEARKRILGSASPEEEQEKPILDRPTRISQPEDSRQPNNVIRQPLGPDGSQGFKQRR,17188.85138169,17199.05468,,RESID:49@0|RESID:37@50|RESID:37@104,,,1
13755,SZRD1_HUMAN,Q7Z422,SUZ domain-containing protein 1,Q7Z422-1,1,MEDEEVAESWEEAADSGEIDRRLEKKLKITQKESRKSKSPPKVPIVIQDDSLPAGPPPQIRILKRPTSNGVVSSPNSTSRPTLPVKSLAQREAEYAEARKRILGSASPEEEQEKPILDRPTRISQPEDSRQPNNVIRQPLGPDGSQGFKQRR,1,151,151,EDEEVAESWEEAADSGEIDRRLEKKLKITQKESRKSKSPPKVPIVIQDDSLPAGPPPQIRILKRPTSNGVVSSPNSTSRPTLPVKSLAQREAEYAEARKRILGSASPEEEQEKPILDRPTRISQPEDSRQPNNVIRQPLGPDGSQGFKQRR,17095.76665769,17105.80208,,RESID:37@35|RESID:37@37|RESID:37@49,,,1
13756,SZRD1_HUMAN,Q7Z422,SUZ domain-containing protein 1,Q7Z422-1,1,MEDEEVAESWEEAADSGEIDRRLEKKLKITQKESRKSKSPPKVPIVIQDDSLPAGPPPQIRILKRPTSNGVVSSPNSTSRPTLPVKSLAQREAEYAEARKRILGSASPEEEQEKPILDRPTRISQPEDSRQPNNVIRQPLGPDGSQGFKQRR,0,151,152,MEDEEVAESWEEAADSGEIDRRLEKKLKITQKESRKSKSPPKVPIVIQDDSLPAGPPPQIRILKRPTSNGVVSSPNSTSRPTLPVKSLAQREAEYAEARKRILGSASPEEEQEKPILDRPTRISQPEDSRQPNNVIRQPLGPDGSQGFKQRR,16986.90815469,16997.05468,,,,,1
13868,SZRD1_HUMAN,Q7Z422,SUZ domain-containing protein 1,Q7Z422-1,1,MEDEEVAESWEEAADSGEIDRRLEKKLKITQKESRKSKSPPKVPIVIQDDSLPAGPPPQIRILKRPTSNGVVSSPNSTSRPTLPVKSLAQREAEYAEARKRILGSASPEEEQEKPILDRPTRISQPEDSRQPNNVIRQPLGPDGSQGFKQRR,1,151,151,EDEEVAESWEEAADSGEIDRRLEKKLKITQKESRKSKSPPKVPIVIQDDSLPAGPPPQIRILKRPTSNGVVSSPNSTSRPTLPVKSLAQREAEYAEARKRILGSASPEEEQEKPILDRPTRISQPEDSRQPNNVIRQPLGPDGSQGFKQRR,17015.80032669,17025.82208,,RESID:37@35|RESID:37@37,,,1
13869,SZRD1_HUMAN,Q7Z422,SUZ domain-containing protein 1,Q7Z422-1,1,MEDEEVAESWEEAADSGEIDRRLEKKLKITQKESRKSKSPPKVPIVIQDDSLPAGPPPQIRILKRPTSNGVVSSPNSTSRPTLPVKSLAQREAEYAEARKRILGSASPEEEQEKPILDRPTRISQPEDSRQPNNVIRQPLGPDGSQGFKQRR,0,151,152,MEDEEVAESWEEAADSGEIDRRLEKKLKITQKESRKSKSPPKVPIVIQDDSLPAGPPPQIRILKRPTSNGVVSSPNSTSRPTLPVKSLAQREAEYAEARKRILGSASPEEEQEKPILDRPTRISQPEDSRQPNNVIRQPLGPDGSQGFKQRR,17268.81771269,17279.03468,,RESID:49@0|RESID:37@36|RESID:37@38|RESID:37@50,,,1
14279,SZRD1_HUMAN,Q7Z422,SUZ domain-containing protein 1,Q7Z422-1,1,MEDEEVAESWEEAADSGEIDRRLEKKLKITQKESRKSKSPPKVPIVIQDDSLPAGPPPQIRILKRPTSNGVVSSPNSTSRPTLPVKSLAQREAEYAEARKRILGSASPEEEQEKPILDRPTRISQPEDSRQPNNVIRQPLGPDGSQGFKQRR,0,151,152,MEDEEVAESWEEAADSGEIDRRLEKKLKITQKESRKSKSPPKVPIVIQDDSLPAGPPPQIRILKRPTSNGVVSSPNSTSRPTLPVKSLAQREAEYAEARKRILGSASPEEEQEKPILDRPTRISQPEDSRQPNNVIRQPLGPDGSQGFKQRR,17108.88505069,17119.07468,,RESID:49@0|RESID:37@104,,,1
14280,SZRD1_HUMAN,Q7Z422,SUZ domain-containing protein 1,Q7Z422-1,1,MEDEEVAESWEEAADSGEIDRRLEKKLKITQKESRKSKSPPKVPIVIQDDSLPAGPPPQIRILKRPTSNGVVSSPNSTSRPTLPVKSLAQREAEYAEARKRILGSASPEEEQEKPILDRPTRISQPEDSRQPNNVIRQPLGPDGSQGFKQRR,0,151,152,MEDEEVAESWEEAADSGEIDRRLEKKLKITQKESRKSKSPPKVPIVIQDDSLPAGPPPQIRILKRPTSNGVVSSPNSTSRPTLPVKSLAQREAEYAEARKRILGSASPEEEQEKPILDRPTRISQPEDSRQPNNVIRQPLGPDGSQGFKQRR,17188.85138169,17199.05468,,RESID:49@0|RESID:37@36|RESID:37@104,,,1
15937,SZRD1_HUMAN,Q7Z422,SUZ domain-containing protein 1,Q7Z422-1,1,MEDEEVAESWEEAADSGEIDRRLEKKLKITQKESRKSKSPPKVPIVIQDDSLPAGPPPQIRILKRPTSNGVVSSPNSTSRPTLPVKSLAQREAEYAEARKRILGSASPEEEQEKPILDRPTRISQPEDSRQPNNVIRQPLGPDGSQGFKQRR,0,151,152,MEDEEVAESWEEAADSGEIDRRLEKKLKITQKESRKSKSPPKVPIVIQDDSLPAGPPPQIRILKRPTSNGVVSSPNSTSRPTLPVKSLAQREAEYAEARKRILGSASPEEEQEKPILDRPTRISQPEDSRQPNNVIRQPLGPDGSQGFKQRR,17028.91872,17039.09468,,,PSI-MOD:1458,,0
