PFR,UniProt Id,Entry Accession,Entry Description,Isoform Accession,Isoform Description,Isoform Sequence,Start,End,Length,Proteoform Sequence,Monoisotopic Mass,Average Mass,Sequence Modifications,PTMs,N-Terminal,C-Terminal,Star
2794,THOC4_HUMAN,Q86V81,THO complex subunit 4,Q86V81,,MADKMDMSLDDIIKLNRSQRGGRGGGRGRGRAGSQGGRGGGAQAAARVNRGGGPIRNRPAIARGAAGGGGRNRPAPYSRPKQLPDKWQHDLFDSGFGGGAGVETGGKLLVSNLDFGVSDADIQELFAEFGTLKKAAVHYDRSGRSLGTADVHFERKADALKAMKQYNGVPLDGRPMNIQLVTSQIDAQRRPAQSVNRGGMTRNRGAGGFGGGGGTRRGTRGGARGRGRGAGRNSKQQLSAEELDAQLDAYNARMDTS,1,256,256,ADKMDMSLDDIIKLNRSQRGGRGGGRGRGRAGSQGGRGGGAQAAARVNRGGGPIRNRPAIARGAAGGGGRNRPAPYSRPKQLPDKWQHDLFDSGFGGGAGVETGGKLLVSNLDFGVSDADIQELFAEFGTLKKAAVHYDRSGRSLGTADVHFERKADALKAMKQYNGVPLDGRPMNIQLVTSQIDAQRRPAQSVNRGGMTRNRGAGGFGGGGGTRRGTRGGARGRGRGAGRNSKQQLSAEELDAQLDAYNARMDTS,26782.58960969,26798.73968,,RESID:41@0,,,1
2805,THOC4_HUMAN,Q86V81,THO complex subunit 4,Q86V81,,MADKMDMSLDDIIKLNRSQRGGRGGGRGRGRAGSQGGRGGGAQAAARVNRGGGPIRNRPAIARGAAGGGGRNRPAPYSRPKQLPDKWQHDLFDSGFGGGAGVETGGKLLVSNLDFGVSDADIQELFAEFGTLKKAAVHYDRSGRSLGTADVHFERKADALKAMKQYNGVPLDGRPMNIQLVTSQIDAQRRPAQSVNRGGMTRNRGAGGFGGGGGTRRGTRGGARGRGRGAGRNSKQQLSAEELDAQLDAYNARMDTS,1,256,256,ADKMDMSLDDIIKLNRSQRGGRGGGRGRGRAGSQGGRGGGAQAAARVNRGGGPIRNRPAIARGAAGGGGRNRPAPYSRPKQLPDKWQHDLFDSGFGGGAGVETGGKLLVSNLDFGVSDADIQELFAEFGTLKKAAVHYDRSGRSLGTADVHFERKADALKAMKQYNGVPLDGRPMNIQLVTSQIDAQRRPAQSVNRGGMTRNRGAGGFGGGGGTRRGTRGGARGRGRGAGRNSKQQLSAEELDAQLDAYNARMDTS,26942.52227169,26958.69968,,RESID:41@0|RESID:37@6|RESID:37@181,,,1
3207,THOC4_HUMAN,Q86V81,THO complex subunit 4,Q86V81,,MADKMDMSLDDIIKLNRSQRGGRGGGRGRGRAGSQGGRGGGAQAAARVNRGGGPIRNRPAIARGAAGGGGRNRPAPYSRPKQLPDKWQHDLFDSGFGGGAGVETGGKLLVSNLDFGVSDADIQELFAEFGTLKKAAVHYDRSGRSLGTADVHFERKADALKAMKQYNGVPLDGRPMNIQLVTSQIDAQRRPAQSVNRGGMTRNRGAGGFGGGGGTRRGTRGGARGRGRGAGRNSKQQLSAEELDAQLDAYNARMDTS,0,256,257,MADKMDMSLDDIIKLNRSQRGGRGGGRGRGRAGSQGGRGGGAQAAARVNRGGGPIRNRPAIARGAAGGGGRNRPAPYSRPKQLPDKWQHDLFDSGFGGGAGVETGGKLLVSNLDFGVSDADIQELFAEFGTLKKAAVHYDRSGRSLGTADVHFERKADALKAMKQYNGVPLDGRPMNIQLVTSQIDAQRRPAQSVNRGGMTRNRGAGGFGGGGGTRRGTRGGARGRGRGAGRNSKQQLSAEELDAQLDAYNARMDTS,26913.63009969,26929.93228,,RESID:49@0,,,1
3462,THOC4_HUMAN,Q86V81,THO complex subunit 4,Q86V81,,MADKMDMSLDDIIKLNRSQRGGRGGGRGRGRAGSQGGRGGGAQAAARVNRGGGPIRNRPAIARGAAGGGGRNRPAPYSRPKQLPDKWQHDLFDSGFGGGAGVETGGKLLVSNLDFGVSDADIQELFAEFGTLKKAAVHYDRSGRSLGTADVHFERKADALKAMKQYNGVPLDGRPMNIQLVTSQIDAQRRPAQSVNRGGMTRNRGAGGFGGGGGTRRGTRGGARGRGRGAGRNSKQQLSAEELDAQLDAYNARMDTS,1,256,256,ADKMDMSLDDIIKLNRSQRGGRGGGRGRGRAGSQGGRGGGAQAAARVNRGGGPIRNRPAIARGAAGGGGRNRPAPYSRPKQLPDKWQHDLFDSGFGGGAGVETGGKLLVSNLDFGVSDADIQELFAEFGTLKKAAVHYDRSGRSLGTADVHFERKADALKAMKQYNGVPLDGRPMNIQLVTSQIDAQRRPAQSVNRGGMTRNRGAGGFGGGGGTRRGTRGGARGRGRGAGRNSKQQLSAEELDAQLDAYNARMDTS,26956.53792169,26972.72968,,RESID:41@0|RESID:37@6|RESID:37@181|RESID:69@218,,,1
3758,THOC4_HUMAN,Q86V81,THO complex subunit 4,Q86V81,,MADKMDMSLDDIIKLNRSQRGGRGGGRGRGRAGSQGGRGGGAQAAARVNRGGGPIRNRPAIARGAAGGGGRNRPAPYSRPKQLPDKWQHDLFDSGFGGGAGVETGGKLLVSNLDFGVSDADIQELFAEFGTLKKAAVHYDRSGRSLGTADVHFERKADALKAMKQYNGVPLDGRPMNIQLVTSQIDAQRRPAQSVNRGGMTRNRGAGGFGGGGGTRRGTRGGARGRGRGAGRNSKQQLSAEELDAQLDAYNARMDTS,0,256,257,MADKMDMSLDDIIKLNRSQRGGRGGGRGRGRAGSQGGRGGGAQAAARVNRGGGPIRNRPAIARGAAGGGGRNRPAPYSRPKQLPDKWQHDLFDSGFGGGAGVETGGKLLVSNLDFGVSDADIQELFAEFGTLKKAAVHYDRSGRSLGTADVHFERKADALKAMKQYNGVPLDGRPMNIQLVTSQIDAQRRPAQSVNRGGMTRNRGAGGFGGGGGTRRGTRGGARGRGRGAGRNSKQQLSAEELDAQLDAYNARMDTS,26885.63518469,26901.92228,,RESID:69@219,,,1
3929,THOC4_HUMAN,Q86V81,THO complex subunit 4,Q86V81,,MADKMDMSLDDIIKLNRSQRGGRGGGRGRGRAGSQGGRGGGAQAAARVNRGGGPIRNRPAIARGAAGGGGRNRPAPYSRPKQLPDKWQHDLFDSGFGGGAGVETGGKLLVSNLDFGVSDADIQELFAEFGTLKKAAVHYDRSGRSLGTADVHFERKADALKAMKQYNGVPLDGRPMNIQLVTSQIDAQRRPAQSVNRGGMTRNRGAGGFGGGGGTRRGTRGGARGRGRGAGRNSKQQLSAEELDAQLDAYNARMDTS,1,256,256,ADKMDMSLDDIIKLNRSQRGGRGGGRGRGRAGSQGGRGGGAQAAARVNRGGGPIRNRPAIARGAAGGGGRNRPAPYSRPKQLPDKWQHDLFDSGFGGGAGVETGGKLLVSNLDFGVSDADIQELFAEFGTLKKAAVHYDRSGRSLGTADVHFERKADALKAMKQYNGVPLDGRPMNIQLVTSQIDAQRRPAQSVNRGGMTRNRGAGGFGGGGGTRRGTRGGARGRGRGAGRNSKQQLSAEELDAQLDAYNARMDTS,26834.56102569,26850.70968,,RESID:37@6|RESID:69@218,,,1
4300,THOC4_HUMAN,Q86V81,THO complex subunit 4,Q86V81,,MADKMDMSLDDIIKLNRSQRGGRGGGRGRGRAGSQGGRGGGAQAAARVNRGGGPIRNRPAIARGAAGGGGRNRPAPYSRPKQLPDKWQHDLFDSGFGGGAGVETGGKLLVSNLDFGVSDADIQELFAEFGTLKKAAVHYDRSGRSLGTADVHFERKADALKAMKQYNGVPLDGRPMNIQLVTSQIDAQRRPAQSVNRGGMTRNRGAGGFGGGGGTRRGTRGGARGRGRGAGRNSKQQLSAEELDAQLDAYNARMDTS,1,256,256,ADKMDMSLDDIIKLNRSQRGGRGGGRGRGRAGSQGGRGGGAQAAARVNRGGGPIRNRPAIARGAAGGGGRNRPAPYSRPKQLPDKWQHDLFDSGFGGGAGVETGGKLLVSNLDFGVSDADIQELFAEFGTLKKAAVHYDRSGRSLGTADVHFERKADALKAMKQYNGVPLDGRPMNIQLVTSQIDAQRRPAQSVNRGGMTRNRGAGGFGGGGGTRRGTRGGARGRGRGAGRNSKQQLSAEELDAQLDAYNARMDTS,26740.57904469,26756.69968,,,,,1
8567,THOC4_HUMAN,Q86V81,THO complex subunit 4,Q86V81,,MADKMDMSLDDIIKLNRSQRGGRGGGRGRGRAGSQGGRGGGAQAAARVNRGGGPIRNRPAIARGAAGGGGRNRPAPYSRPKQLPDKWQHDLFDSGFGGGAGVETGGKLLVSNLDFGVSDADIQELFAEFGTLKKAAVHYDRSGRSLGTADVHFERKADALKAMKQYNGVPLDGRPMNIQLVTSQIDAQRRPAQSVNRGGMTRNRGAGGFGGGGGTRRGTRGGARGRGRGAGRNSKQQLSAEELDAQLDAYNARMDTS,1,256,256,ADKMDMSLDDIIKLNRSQRGGRGGGRGRGRAGSQGGRGGGAQAAARVNRGGGPIRNRPAIARGAAGGGGRNRPAPYSRPKQLPDKWQHDLFDSGFGGGAGVETGGKLLVSNLDFGVSDADIQELFAEFGTLKKAAVHYDRSGRSLGTADVHFERKADALKAMKQYNGVPLDGRPMNIQLVTSQIDAQRRPAQSVNRGGMTRNRGAGGFGGGGGTRRGTRGGARGRGRGAGRNSKQQLSAEELDAQLDAYNARMDTS,26876.57159069,26892.74968,,RESID:41@0|RESID:37@6|RESID:69@218,,,1
14199,THOC4_HUMAN,Q86V81,THO complex subunit 4,Q86V81,,MADKMDMSLDDIIKLNRSQRGGRGGGRGRGRAGSQGGRGGGAQAAARVNRGGGPIRNRPAIARGAAGGGGRNRPAPYSRPKQLPDKWQHDLFDSGFGGGAGVETGGKLLVSNLDFGVSDADIQELFAEFGTLKKAAVHYDRSGRSLGTADVHFERKADALKAMKQYNGVPLDGRPMNIQLVTSQIDAQRRPAQSVNRGGMTRNRGAGGFGGGGGTRRGTRGGARGRGRGAGRNSKQQLSAEELDAQLDAYNARMDTS,0,256,257,MADKMDMSLDDIIKLNRSQRGGRGGGRGRGRAGSQGGRGGGAQAAARVNRGGGPIRNRPAIARGAAGGGGRNRPAPYSRPKQLPDKWQHDLFDSGFGGGAGVETGGKLLVSNLDFGVSDADIQELFAEFGTLKKAAVHYDRSGRSLGTADVHFERKADALKAMKQYNGVPLDGRPMNIQLVTSQIDAQRRPAQSVNRGGMTRNRGAGGFGGGGGTRRGTRGGARGRGRGAGRNSKQQLSAEELDAQLDAYNARMDTS,27031.55219669,27047.85228,,RESID:37@93|RESID:37@238,,,1
14200,THOC4_HUMAN,Q86V81,THO complex subunit 4,Q86V81,,MADKMDMSLDDIIKLNRSQRGGRGGGRGRGRAGSQGGRGGGAQAAARVNRGGGPIRNRPAIARGAAGGGGRNRPAPYSRPKQLPDKWQHDLFDSGFGGGAGVETGGKLLVSNLDFGVSDADIQELFAEFGTLKKAAVHYDRSGRSLGTADVHFERKADALKAMKQYNGVPLDGRPMNIQLVTSQIDAQRRPAQSVNRGGMTRNRGAGGFGGGGGTRRGTRGGARGRGRGAGRNSKQQLSAEELDAQLDAYNARMDTS,1,256,256,ADKMDMSLDDIIKLNRSQRGGRGGGRGRGRAGSQGGRGGGAQAAARVNRGGGPIRNRPAIARGAAGGGGRNRPAPYSRPKQLPDKWQHDLFDSGFGGGAGVETGGKLLVSNLDFGVSDADIQELFAEFGTLKKAAVHYDRSGRSLGTADVHFERKADALKAMKQYNGVPLDGRPMNIQLVTSQIDAQRRPAQSVNRGGMTRNRGAGGFGGGGGTRRGTRGGARGRGRGAGRNSKQQLSAEELDAQLDAYNARMDTS,27064.53555269,27080.75968,,RESID:41@0|RESID:37@6|RESID:37@92|RESID:67@202|RESID:69@218|RESID:37@237,,,1
14392,THOC4_HUMAN,Q86V81,THO complex subunit 4,Q86V81,,MADKMDMSLDDIIKLNRSQRGGRGGGRGRGRAGSQGGRGGGAQAAARVNRGGGPIRNRPAIARGAAGGGGRNRPAPYSRPKQLPDKWQHDLFDSGFGGGAGVETGGKLLVSNLDFGVSDADIQELFAEFGTLKKAAVHYDRSGRSLGTADVHFERKADALKAMKQYNGVPLDGRPMNIQLVTSQIDAQRRPAQSVNRGGMTRNRGAGGFGGGGGTRRGTRGGARGRGRGAGRNSKQQLSAEELDAQLDAYNARMDTS,0,256,257,MADKMDMSLDDIIKLNRSQRGGRGGGRGRGRAGSQGGRGGGAQAAARVNRGGGPIRNRPAIARGAAGGGGRNRPAPYSRPKQLPDKWQHDLFDSGFGGGAGVETGGKLLVSNLDFGVSDADIQELFAEFGTLKKAAVHYDRSGRSLGTADVHFERKADALKAMKQYNGVPLDGRPMNIQLVTSQIDAQRRPAQSVNRGGMTRNRGAGGFGGGGGTRRGTRGGARGRGRGAGRNSKQQLSAEELDAQLDAYNARMDTS,27021.62773069,27037.96228,,RESID:49@0|RESID:37@93|RESID:67@203,,,1
