PFR,UniProt Id,Entry Accession,Entry Description,Isoform Accession,Isoform Description,Isoform Sequence,Start,End,Length,Proteoform Sequence,Monoisotopic Mass,Average Mass,Sequence Modifications,PTMs,N-Terminal,C-Terminal,Star
9615,MPCP_MOUSE,Q8VEM8,Phosphate carrier protein; mitochondrial,Q8VEM8,,MFSSVAHLARANPFNAPHLQLVHDGLSGPRSPPAPPRRSRHLAAAAVEEYSCEFGSMKYYALCGFGGVLSCGLTHTAVVPLDLVKCRMQVDPQKYKGIFNGFSITLKEDGVRGLAKGWAPTLIGYSMQGLCKFGFYEVFKALYSNILGEENTYLWRTSLYLASSASAEFFADIALAPMEAAKVRIQTQPGYANTLREAVPKMYKEEGLNAFYKGVAPLWMRQIPYTMMKFACFERTVEALYKFVVPKPRSECTKAEQLVVTFVAGYIAGVFCAIVSHPADSVVSVLNKEKGSTASQVLQRLGFRGVWKGLFARIIMIGTLTALQWFIYDSVKVYFRLPRPPPPEMPESLKKKLGLTE,45,356,312,AVEEYSCEFGSMKYYALCGFGGVLSCGLTHTAVVPLDLVKCRMQVDPQKYKGIFNGFSITLKEDGVRGLAKGWAPTLIGYSMQGLCKFGFYEVFKALYSNILGEENTYLWRTSLYLASSASAEFFADIALAPMEAAKVRIQTQPGYANTLREAVPKMYKEEGLNAFYKGVAPLWMRQIPYTMMKFACFERTVEALYKFVVPKPRSECTKAEQLVVTFVAGYIAGVFCAIVSHPADSVVSVLNKEKGSTASQVLQRLGFRGVWKGLFARIIMIGTLTALQWFIYDSVKVYFRLPRPPPPEMPESLKKKLGLTE,34942.91714069,34965.85928,,RESID:55@48|RESID:39@145,,,1
9714,MPCP_MOUSE,Q8VEM8,Phosphate carrier protein; mitochondrial,Q8VEM8,,MFSSVAHLARANPFNAPHLQLVHDGLSGPRSPPAPPRRSRHLAAAAVEEYSCEFGSMKYYALCGFGGVLSCGLTHTAVVPLDLVKCRMQVDPQKYKGIFNGFSITLKEDGVRGLAKGWAPTLIGYSMQGLCKFGFYEVFKALYSNILGEENTYLWRTSLYLASSASAEFFADIALAPMEAAKVRIQTQPGYANTLREAVPKMYKEEGLNAFYKGVAPLWMRQIPYTMMKFACFERTVEALYKFVVPKPRSECTKAEQLVVTFVAGYIAGVFCAIVSHPADSVVSVLNKEKGSTASQVLQRLGFRGVWKGLFARIIMIGTLTALQWFIYDSVKVYFRLPRPPPPEMPESLKKKLGLTE,45,356,312,AVEEYSCEFGSMKYYALCGFGGVLSCGLTHTAVVPLDLVKCRMQVDPQKYKGIFNGFSITLKEDGVRGLAKGWAPTLIGYSMQGLCKFGFYEVFKALYSNILGEENTYLWRTSLYLASSASAEFFADIALAPMEAAKVRIQTQPGYANTLREAVPKMYKEEGLNAFYKGVAPLWMRQIPYTMMKFACFERTVEALYKFVVPKPRSECTKAEQLVVTFVAGYIAGVFCAIVSHPADSVVSVLNKEKGSTASQVLQRLGFRGVWKGLFARIIMIGTLTALQWFIYDSVKVYFRLPRPPPPEMPESLKKKLGLTE,34820.94024469,34843.83928,,,,,1
9719,MPCP_MOUSE,Q8VEM8,Phosphate carrier protein; mitochondrial,Q8VEM8,,MFSSVAHLARANPFNAPHLQLVHDGLSGPRSPPAPPRRSRHLAAAAVEEYSCEFGSMKYYALCGFGGVLSCGLTHTAVVPLDLVKCRMQVDPQKYKGIFNGFSITLKEDGVRGLAKGWAPTLIGYSMQGLCKFGFYEVFKALYSNILGEENTYLWRTSLYLASSASAEFFADIALAPMEAAKVRIQTQPGYANTLREAVPKMYKEEGLNAFYKGVAPLWMRQIPYTMMKFACFERTVEALYKFVVPKPRSECTKAEQLVVTFVAGYIAGVFCAIVSHPADSVVSVLNKEKGSTASQVLQRLGFRGVWKGLFARIIMIGTLTALQWFIYDSVKVYFRLPRPPPPEMPESLKKKLGLTE,45,356,312,AVEEYSCEFGSMKYYALCGFGGVLSCGLTHTAVVPLDLVKCRMQVDPQKYKGIFNGFSITLKEDGVRGLAKGWAPTLIGYSMQGLCKFGFYEVFKALYSNILGEENTYLWRTSLYLASSASAEFFADIALAPMEAAKVRIQTQPGYANTLREAVPKMYKEEGLNAFYKGVAPLWMRQIPYTMMKFACFERTVEALYKFVVPKPRSECTKAEQLVVTFVAGYIAGVFCAIVSHPADSVVSVLNKEKGSTASQVLQRLGFRGVWKGLFARIIMIGTLTALQWFIYDSVKVYFRLPRPPPPEMPESLKKKLGLTE,34862.95080969,34885.87928,,RESID:41@0,,,1
9855,MPCP_MOUSE,Q8VEM8,Phosphate carrier protein; mitochondrial,Q8VEM8,,MFSSVAHLARANPFNAPHLQLVHDGLSGPRSPPAPPRRSRHLAAAAVEEYSCEFGSMKYYALCGFGGVLSCGLTHTAVVPLDLVKCRMQVDPQKYKGIFNGFSITLKEDGVRGLAKGWAPTLIGYSMQGLCKFGFYEVFKALYSNILGEENTYLWRTSLYLASSASAEFFADIALAPMEAAKVRIQTQPGYANTLREAVPKMYKEEGLNAFYKGVAPLWMRQIPYTMMKFACFERTVEALYKFVVPKPRSECTKAEQLVVTFVAGYIAGVFCAIVSHPADSVVSVLNKEKGSTASQVLQRLGFRGVWKGLFARIIMIGTLTALQWFIYDSVKVYFRLPRPPPPEMPESLKKKLGLTE,0,356,357,MFSSVAHLARANPFNAPHLQLVHDGLSGPRSPPAPPRRSRHLAAAAVEEYSCEFGSMKYYALCGFGGVLSCGLTHTAVVPLDLVKCRMQVDPQKYKGIFNGFSITLKEDGVRGLAKGWAPTLIGYSMQGLCKFGFYEVFKALYSNILGEENTYLWRTSLYLASSASAEFFADIALAPMEAAKVRIQTQPGYANTLREAVPKMYKEEGLNAFYKGVAPLWMRQIPYTMMKFACFERTVEALYKFVVPKPRSECTKAEQLVVTFVAGYIAGVFCAIVSHPADSVVSVLNKEKGSTASQVLQRLGFRGVWKGLFARIIMIGTLTALQWFIYDSVKVYFRLPRPPPPEMPESLKKKLGLTE,39648.46707969,39674.3581799999,,RESID:49@0,,,1
9924,MPCP_MOUSE,Q8VEM8,Phosphate carrier protein; mitochondrial,Q8VEM8,,MFSSVAHLARANPFNAPHLQLVHDGLSGPRSPPAPPRRSRHLAAAAVEEYSCEFGSMKYYALCGFGGVLSCGLTHTAVVPLDLVKCRMQVDPQKYKGIFNGFSITLKEDGVRGLAKGWAPTLIGYSMQGLCKFGFYEVFKALYSNILGEENTYLWRTSLYLASSASAEFFADIALAPMEAAKVRIQTQPGYANTLREAVPKMYKEEGLNAFYKGVAPLWMRQIPYTMMKFACFERTVEALYKFVVPKPRSECTKAEQLVVTFVAGYIAGVFCAIVSHPADSVVSVLNKEKGSTASQVLQRLGFRGVWKGLFARIIMIGTLTALQWFIYDSVKVYFRLPRPPPPEMPESLKKKLGLTE,1,356,356,FSSVAHLARANPFNAPHLQLVHDGLSGPRSPPAPPRRSRHLAAAAVEEYSCEFGSMKYYALCGFGGVLSCGLTHTAVVPLDLVKCRMQVDPQKYKGIFNGFSITLKEDGVRGLAKGWAPTLIGYSMQGLCKFGFYEVFKALYSNILGEENTYLWRTSLYLASSASAEFFADIALAPMEAAKVRIQTQPGYANTLREAVPKMYKEEGLNAFYKGVAPLWMRQIPYTMMKFACFERTVEALYKFVVPKPRSECTKAEQLVVTFVAGYIAGVFCAIVSHPADSVVSVLNKEKGSTASQVLQRLGFRGVWKGLFARIIMIGTLTALQWFIYDSVKVYFRLPRPPPPEMPESLKKKLGLTE,39475.41602469,39501.1255799999,,,,,1
9933,MPCP_MOUSE,Q8VEM8,Phosphate carrier protein; mitochondrial,Q8VEM8,,MFSSVAHLARANPFNAPHLQLVHDGLSGPRSPPAPPRRSRHLAAAAVEEYSCEFGSMKYYALCGFGGVLSCGLTHTAVVPLDLVKCRMQVDPQKYKGIFNGFSITLKEDGVRGLAKGWAPTLIGYSMQGLCKFGFYEVFKALYSNILGEENTYLWRTSLYLASSASAEFFADIALAPMEAAKVRIQTQPGYANTLREAVPKMYKEEGLNAFYKGVAPLWMRQIPYTMMKFACFERTVEALYKFVVPKPRSECTKAEQLVVTFVAGYIAGVFCAIVSHPADSVVSVLNKEKGSTASQVLQRLGFRGVWKGLFARIIMIGTLTALQWFIYDSVKVYFRLPRPPPPEMPESLKKKLGLTE,0,356,357,MFSSVAHLARANPFNAPHLQLVHDGLSGPRSPPAPPRRSRHLAAAAVEEYSCEFGSMKYYALCGFGGVLSCGLTHTAVVPLDLVKCRMQVDPQKYKGIFNGFSITLKEDGVRGLAKGWAPTLIGYSMQGLCKFGFYEVFKALYSNILGEENTYLWRTSLYLASSASAEFFADIALAPMEAAKVRIQTQPGYANTLREAVPKMYKEEGLNAFYKGVAPLWMRQIPYTMMKFACFERTVEALYKFVVPKPRSECTKAEQLVVTFVAGYIAGVFCAIVSHPADSVVSVLNKEKGSTASQVLQRLGFRGVWKGLFARIIMIGTLTALQWFIYDSVKVYFRLPRPPPPEMPESLKKKLGLTE,39648.46707969,39674.3581799999,,RESID:55@93,,,1
10060,MPCP_MOUSE,Q8VEM8,Phosphate carrier protein; mitochondrial,Q8VEM8,,MFSSVAHLARANPFNAPHLQLVHDGLSGPRSPPAPPRRSRHLAAAAVEEYSCEFGSMKYYALCGFGGVLSCGLTHTAVVPLDLVKCRMQVDPQKYKGIFNGFSITLKEDGVRGLAKGWAPTLIGYSMQGLCKFGFYEVFKALYSNILGEENTYLWRTSLYLASSASAEFFADIALAPMEAAKVRIQTQPGYANTLREAVPKMYKEEGLNAFYKGVAPLWMRQIPYTMMKFACFERTVEALYKFVVPKPRSECTKAEQLVVTFVAGYIAGVFCAIVSHPADSVVSVLNKEKGSTASQVLQRLGFRGVWKGLFARIIMIGTLTALQWFIYDSVKVYFRLPRPPPPEMPESLKKKLGLTE,45,356,312,AVEEYSCEFGSMKYYALCGFGGVLSCGLTHTAVVPLDLVKCRMQVDPQKYKGIFNGFSITLKEDGVRGLAKGWAPTLIGYSMQGLCKFGFYEVFKALYSNILGEENTYLWRTSLYLASSASAEFFADIALAPMEAAKVRIQTQPGYANTLREAVPKMYKEEGLNAFYKGVAPLWMRQIPYTMMKFACFERTVEALYKFVVPKPRSECTKAEQLVVTFVAGYIAGVFCAIVSHPADSVVSVLNKEKGSTASQVLQRLGFRGVWKGLFARIIMIGTLTALQWFIYDSVKVYFRLPRPPPPEMPESLKKKLGLTE,34862.95080969,34885.87928,,RESID:55@48,,,1
10165,MPCP_MOUSE,Q8VEM8,Phosphate carrier protein; mitochondrial,Q8VEM8,,MFSSVAHLARANPFNAPHLQLVHDGLSGPRSPPAPPRRSRHLAAAAVEEYSCEFGSMKYYALCGFGGVLSCGLTHTAVVPLDLVKCRMQVDPQKYKGIFNGFSITLKEDGVRGLAKGWAPTLIGYSMQGLCKFGFYEVFKALYSNILGEENTYLWRTSLYLASSASAEFFADIALAPMEAAKVRIQTQPGYANTLREAVPKMYKEEGLNAFYKGVAPLWMRQIPYTMMKFACFERTVEALYKFVVPKPRSECTKAEQLVVTFVAGYIAGVFCAIVSHPADSVVSVLNKEKGSTASQVLQRLGFRGVWKGLFARIIMIGTLTALQWFIYDSVKVYFRLPRPPPPEMPESLKKKLGLTE,45,356,312,AVEEYSCEFGSMKYYALCGFGGVLSCGLTHTAVVPLDLVKCRMQVDPQKYKGIFNGFSITLKEDGVRGLAKGWAPTLIGYSMQGLCKFGFYEVFKALYSNILGEENTYLWRTSLYLASSASAEFFADIALAPMEAAKVRIQTQPGYANTLREAVPKMYKEEGLNAFYKGVAPLWMRQIPYTMMKFACFERTVEALYKFVVPKPRSECTKAEQLVVTFVAGYIAGVFCAIVSHPADSVVSVLNKEKGSTASQVLQRLGFRGVWKGLFARIIMIGTLTALQWFIYDSVKVYFRLPRPPPPEMPESLKKKLGLTE,34984.92770569,35007.89928,,RESID:55@48|RESID:39@145|RESID:55@158,,,1
10170,MPCP_MOUSE,Q8VEM8,Phosphate carrier protein; mitochondrial,Q8VEM8,,MFSSVAHLARANPFNAPHLQLVHDGLSGPRSPPAPPRRSRHLAAAAVEEYSCEFGSMKYYALCGFGGVLSCGLTHTAVVPLDLVKCRMQVDPQKYKGIFNGFSITLKEDGVRGLAKGWAPTLIGYSMQGLCKFGFYEVFKALYSNILGEENTYLWRTSLYLASSASAEFFADIALAPMEAAKVRIQTQPGYANTLREAVPKMYKEEGLNAFYKGVAPLWMRQIPYTMMKFACFERTVEALYKFVVPKPRSECTKAEQLVVTFVAGYIAGVFCAIVSHPADSVVSVLNKEKGSTASQVLQRLGFRGVWKGLFARIIMIGTLTALQWFIYDSVKVYFRLPRPPPPEMPESLKKKLGLTE,45,356,312,AVEEYSCEFGSMKYYALCGFGGVLSCGLTHTAVVPLDLVKCRMQVDPQKYKGIFNGFSITLKEDGVRGLAKGWAPTLIGYSMQGLCKFGFYEVFKALYSNILGEENTYLWRTSLYLASSASAEFFADIALAPMEAAKVRIQTQPGYANTLREAVPKMYKEEGLNAFYKGVAPLWMRQIPYTMMKFACFERTVEALYKFVVPKPRSECTKAEQLVVTFVAGYIAGVFCAIVSHPADSVVSVLNKEKGSTASQVLQRLGFRGVWKGLFARIIMIGTLTALQWFIYDSVKVYFRLPRPPPPEMPESLKKKLGLTE,35026.93827069,35049.93928,,RESID:41@0|RESID:55@48|RESID:39@145|RESID:55@158,,,1
10497,MPCP_MOUSE,Q8VEM8,Phosphate carrier protein; mitochondrial,Q8VEM8,,MFSSVAHLARANPFNAPHLQLVHDGLSGPRSPPAPPRRSRHLAAAAVEEYSCEFGSMKYYALCGFGGVLSCGLTHTAVVPLDLVKCRMQVDPQKYKGIFNGFSITLKEDGVRGLAKGWAPTLIGYSMQGLCKFGFYEVFKALYSNILGEENTYLWRTSLYLASSASAEFFADIALAPMEAAKVRIQTQPGYANTLREAVPKMYKEEGLNAFYKGVAPLWMRQIPYTMMKFACFERTVEALYKFVVPKPRSECTKAEQLVVTFVAGYIAGVFCAIVSHPADSVVSVLNKEKGSTASQVLQRLGFRGVWKGLFARIIMIGTLTALQWFIYDSVKVYFRLPRPPPPEMPESLKKKLGLTE,0,356,357,MFSSVAHLARANPFNAPHLQLVHDGLSGPRSPPAPPRRSRHLAAAAVEEYSCEFGSMKYYALCGFGGVLSCGLTHTAVVPLDLVKCRMQVDPQKYKGIFNGFSITLKEDGVRGLAKGWAPTLIGYSMQGLCKFGFYEVFKALYSNILGEENTYLWRTSLYLASSASAEFFADIALAPMEAAKVRIQTQPGYANTLREAVPKMYKEEGLNAFYKGVAPLWMRQIPYTMMKFACFERTVEALYKFVVPKPRSECTKAEQLVVTFVAGYIAGVFCAIVSHPADSVVSVLNKEKGSTASQVLQRLGFRGVWKGLFARIIMIGTLTALQWFIYDSVKVYFRLPRPPPPEMPESLKKKLGLTE,39606.45651469,39632.3181799999,,,,,1
