PFR,UniProt Id,Entry Accession,Entry Description,Isoform Accession,Isoform Description,Isoform Sequence,Start,End,Length,Proteoform Sequence,Monoisotopic Mass,Average Mass,Sequence Modifications,PTMs,N-Terminal,C-Terminal,Star
18735,NEUG_HUMAN,Q92686,Neurogranin,Q92686,,MDCCTENACSKPDDDILDIPLDDPGANAAAAKIQASFRGHMARKKIKSGERGRKGPGPGGPGGAGVARGGAGGGPSGD,0,77,78,MDCCTENACSKPDDDILDIPLDDPGANAAAAKIQASFRGHMARKKIKSGERGRKGPGPGGPGGAGVARGGAGGGPSGD,7655.66837,7660.50768,,,PSI-MOD:1458,,0
18736,NEUG_HUMAN,Q92686,Neurogranin,Q92686,,MDCCTENACSKPDDDILDIPLDDPGANAAAAKIQASFRGHMARKKIKSGERGRKGPGPGGPGGAGVARGGAGGGPSGD,21,77,57,DDPGANAAAAKIQASFRGHMARKKIKSGERGRKGPGPGGPGGAGVARGGAGGGPSGD,5321.715985,5324.88918,,,,,0
18737,NEUG_HUMAN,Q92686,Neurogranin,Q92686,,MDCCTENACSKPDDDILDIPLDDPGANAAAAKIQASFRGHMARKKIKSGERGRKGPGPGGPGGAGVARGGAGGGPSGD,0,77,78,MDCCTENACSKPDDDILDIPLDDPGANAAAAKIQASFRGHMARKKIKSGERGRKGPGPGGPGGAGVARGGAGGGPSGD,7613.657805,7618.46768,,,,,0
18738,NEUG_HUMAN,Q92686,Neurogranin,Q92686,,MDCCTENACSKPDDDILDIPLDDPGANAAAAKIQASFRGHMARKKIKSGERGRKGPGPGGPGGAGVARGGAGGGPSGD,35,77,43,SFRGHMARKKIKSGERGRKGPGPGGPGGAGVARGGAGGGPSGD,4028.084695,4030.50258,,,,,0
18739,NEUG_HUMAN,Q92686,Neurogranin,Q92686,,MDCCTENACSKPDDDILDIPLDDPGANAAAAKIQASFRGHMARKKIKSGERGRKGPGPGGPGGAGVARGGAGGGPSGD,1,77,77,DCCTENACSKPDDDILDIPLDDPGANAAAAKIQASFRGHMARKKIKSGERGRKGPGPGGPGGAGVARGGAGGGPSGD,7524.62788,7529.31508,,,PSI-MOD:1458,,0
18740,NEUG_HUMAN,Q92686,Neurogranin,Q92686,,MDCCTENACSKPDDDILDIPLDDPGANAAAAKIQASFRGHMARKKIKSGERGRKGPGPGGPGGAGVARGGAGGGPSGD,22,77,56,DPGANAAAAKIQASFRGHMARKKIKSGERGRKGPGPGGPGGAGVARGGAGGGPSGD,5206.689045,5209.80058,,,,,0
18741,NEUG_HUMAN,Q92686,Neurogranin,Q92686,,MDCCTENACSKPDDDILDIPLDDPGANAAAAKIQASFRGHMARKKIKSGERGRKGPGPGGPGGAGVARGGAGGGPSGD,36,77,42,FRGHMARKKIKSGERGRKGPGPGGPGGAGVARGGAGGGPSGD,3941.052665,3943.42438,,,,,0
18742,NEUG_HUMAN,Q92686,Neurogranin,Q92686,,MDCCTENACSKPDDDILDIPLDDPGANAAAAKIQASFRGHMARKKIKSGERGRKGPGPGGPGGAGVARGGAGGGPSGD,23,77,55,PGANAAAAKIQASFRGHMARKKIKSGERGRKGPGPGGPGGAGVARGGAGGGPSGD,5091.662105,5094.71198,,,,,0
18744,NEUG_HUMAN,Q92686,Neurogranin,Q92686,,MDCCTENACSKPDDDILDIPLDDPGANAAAAKIQASFRGHMARKKIKSGERGRKGPGPGGPGGAGVARGGAGGGPSGD,30,77,48,AKIQASFRGHMARKKIKSGERGRKGPGPGGPGGAGVARGGAGGGPSGD,4539.396515,4542.12438,,,,,0
18745,NEUG_HUMAN,Q92686,Neurogranin,Q92686,,MDCCTENACSKPDDDILDIPLDDPGANAAAAKIQASFRGHMARKKIKSGERGRKGPGPGGPGGAGVARGGAGGGPSGD,33,77,45,QASFRGHMARKKIKSGERGRKGPGPGGPGGAGVARGGAGGGPSGD,4227.180385,4229.71208,,,,,0
18746,NEUG_HUMAN,Q92686,Neurogranin,Q92686,,MDCCTENACSKPDDDILDIPLDDPGANAAAAKIQASFRGHMARKKIKSGERGRKGPGPGGPGGAGVARGGAGGGPSGD,27,77,51,AAAAKIQASFRGHMARKKIKSGERGRKGPGPGGPGGAGVARGGAGGGPSGD,4752.507845,4755.36078,,,,,0
18748,NEUG_HUMAN,Q92686,Neurogranin,Q92686,,MDCCTENACSKPDDDILDIPLDDPGANAAAAKIQASFRGHMARKKIKSGERGRKGPGPGGPGGAGVARGGAGGGPSGD,19,77,59,PLDDPGANAAAAKIQASFRGHMARKKIKSGERGRKGPGPGGPGGAGVARGGAGGGPSGD,5531.852805,5535.16528,,,,,0
18749,NEUG_HUMAN,Q92686,Neurogranin,Q92686,,MDCCTENACSKPDDDILDIPLDDPGANAAAAKIQASFRGHMARKKIKSGERGRKGPGPGGPGGAGVARGGAGGGPSGD,14,77,64,DILDIPLDDPGANAAAAKIQASFRGHMARKKIKSGERGRKGPGPGGPGGAGVARGGAGGGPSGD,6101.158865,6104.82068,,,,,0
