PFR,UniProt Id,Entry Accession,Entry Description,Isoform Accession,Isoform Description,Isoform Sequence,Start,End,Length,Proteoform Sequence,Monoisotopic Mass,Average Mass,Sequence Modifications,PTMs,N-Terminal,C-Terminal,Star
1992,K1143_HUMAN,Q96AT1,Uncharacterized protein KIAA1143,Q96AT1,,MSKRNQVSYVRPAEPAFLARFKERVGYREGPTVETKRIQPQPPDEDGDHSDKEDEQPQVVVLKKGDLSVEEVMKIKAEIKAAKADEEPTPADGRIIYRKPVKHPSDEKYSGLTASSKKKKPNEDEVNQDSVKKNSQKQIKNSSLLSFDNEDENE,1,153,153,SKRNQVSYVRPAEPAFLARFKERVGYREGPTVETKRIQPQPPDEDGDHSDKEDEQPQVVVLKKGDLSVEEVMKIKAEIKAAKADEEPTPADGRIIYRKPVKHPSDEKYSGLTASSKKKKPNEDEVNQDSVKKNSQKQIKNSSLLSFDNEDENE,17487.83653569,17498.30498,,RESID:51@0|RESID:37@48|RESID:55@106,,,1
2327,K1143_HUMAN,Q96AT1,Uncharacterized protein KIAA1143,Q96AT1,,MSKRNQVSYVRPAEPAFLARFKERVGYREGPTVETKRIQPQPPDEDGDHSDKEDEQPQVVVLKKGDLSVEEVMKIKAEIKAAKADEEPTPADGRIIYRKPVKHPSDEKYSGLTASSKKKKPNEDEVNQDSVKKNSQKQIKNSSLLSFDNEDENE,1,153,153,SKRNQVSYVRPAEPAFLARFKERVGYREGPTVETKRIQPQPPDEDGDHSDKEDEQPQVVVLKKGDLSVEEVMKIKAEIKAAKADEEPTPADGRIIYRKPVKHPSDEKYSGLTASSKKKKPNEDEVNQDSVKKNSQKQIKNSSLLSFDNEDENE,17365.85963969,17376.28498,,RESID:51@0,,,1
2328,K1143_HUMAN,Q96AT1,Uncharacterized protein KIAA1143,Q96AT1,,MSKRNQVSYVRPAEPAFLARFKERVGYREGPTVETKRIQPQPPDEDGDHSDKEDEQPQVVVLKKGDLSVEEVMKIKAEIKAAKADEEPTPADGRIIYRKPVKHPSDEKYSGLTASSKKKKPNEDEVNQDSVKKNSQKQIKNSSLLSFDNEDENE,1,153,153,SKRNQVSYVRPAEPAFLARFKERVGYREGPTVETKRIQPQPPDEDGDHSDKEDEQPQVVVLKKGDLSVEEVMKIKAEIKAAKADEEPTPADGRIIYRKPVKHPSDEKYSGLTASSKKKKPNEDEVNQDSVKKNSQKQIKNSSLLSFDNEDENE,17445.82597069,17456.26498,,RESID:51@0|RESID:37@48,,,1
2735,K1143_HUMAN,Q96AT1,Uncharacterized protein KIAA1143,Q96AT1,,MSKRNQVSYVRPAEPAFLARFKERVGYREGPTVETKRIQPQPPDEDGDHSDKEDEQPQVVVLKKGDLSVEEVMKIKAEIKAAKADEEPTPADGRIIYRKPVKHPSDEKYSGLTASSKKKKPNEDEVNQDSVKKNSQKQIKNSSLLSFDNEDENE,1,153,153,SKRNQVSYVRPAEPAFLARFKERVGYREGPTVETKRIQPQPPDEDGDHSDKEDEQPQVVVLKKGDLSVEEVMKIKAEIKAAKADEEPTPADGRIIYRKPVKHPSDEKYSGLTASSKKKKPNEDEVNQDSVKKNSQKQIKNSSLLSFDNEDENE,17407.87020469,17418.32498,,RESID:51@0|RESID:55@106,,,1
2934,K1143_HUMAN,Q96AT1,Uncharacterized protein KIAA1143,Q96AT1,,MSKRNQVSYVRPAEPAFLARFKERVGYREGPTVETKRIQPQPPDEDGDHSDKEDEQPQVVVLKKGDLSVEEVMKIKAEIKAAKADEEPTPADGRIIYRKPVKHPSDEKYSGLTASSKKKKPNEDEVNQDSVKKNSQKQIKNSSLLSFDNEDENE,1,153,153,SKRNQVSYVRPAEPAFLARFKERVGYREGPTVETKRIQPQPPDEDGDHSDKEDEQPQVVVLKKGDLSVEEVMKIKAEIKAAKADEEPTPADGRIIYRKPVKHPSDEKYSGLTASSKKKKPNEDEVNQDSVKKNSQKQIKNSSLLSFDNEDENE,17445.82597069,17456.26498,,RESID:51@0|RESID:37@128,,,1
2957,K1143_HUMAN,Q96AT1,Uncharacterized protein KIAA1143,Q96AT1,,MSKRNQVSYVRPAEPAFLARFKERVGYREGPTVETKRIQPQPPDEDGDHSDKEDEQPQVVVLKKGDLSVEEVMKIKAEIKAAKADEEPTPADGRIIYRKPVKHPSDEKYSGLTASSKKKKPNEDEVNQDSVKKNSQKQIKNSSLLSFDNEDENE,1,153,153,SKRNQVSYVRPAEPAFLARFKERVGYREGPTVETKRIQPQPPDEDGDHSDKEDEQPQVVVLKKGDLSVEEVMKIKAEIKAAKADEEPTPADGRIIYRKPVKHPSDEKYSGLTASSKKKKPNEDEVNQDSVKKNSQKQIKNSSLLSFDNEDENE,17525.79230169,17536.24498,,RESID:51@0|RESID:37@48|RESID:37@128,,,1
14278,K1143_HUMAN,Q96AT1,Uncharacterized protein KIAA1143,Q96AT1,,MSKRNQVSYVRPAEPAFLARFKERVGYREGPTVETKRIQPQPPDEDGDHSDKEDEQPQVVVLKKGDLSVEEVMKIKAEIKAAKADEEPTPADGRIIYRKPVKHPSDEKYSGLTASSKKKKPNEDEVNQDSVKKNSQKQIKNSSLLSFDNEDENE,1,153,153,SKRNQVSYVRPAEPAFLARFKERVGYREGPTVETKRIQPQPPDEDGDHSDKEDEQPQVVVLKKGDLSVEEVMKIKAEIKAAKADEEPTPADGRIIYRKPVKHPSDEKYSGLTASSKKKKPNEDEVNQDSVKKNSQKQIKNSSLLSFDNEDENE,17567.80286669,17578.28498,,RESID:51@0|RESID:37@48|RESID:55@106|RESID:37@144,,,1
16782,K1143_HUMAN,Q96AT1,Uncharacterized protein KIAA1143,Q96AT1,,MSKRNQVSYVRPAEPAFLARFKERVGYREGPTVETKRIQPQPPDEDGDHSDKEDEQPQVVVLKKGDLSVEEVMKIKAEIKAAKADEEPTPADGRIIYRKPVKHPSDEKYSGLTASSKKKKPNEDEVNQDSVKKNSQKQIKNSSLLSFDNEDENE,1,153,153,SKRNQVSYVRPAEPAFLARFKERVGYREGPTVETKRIQPQPPDEDGDHSDKEDEQPQVVVLKKGDLSVEEVMKIKAEIKAAKADEEPTPADGRIIYRKPVKHPSDEKYSGLTASSKKKKPNEDEVNQDSVKKNSQKQIKNSSLLSFDNEDENE,17445.82597,17456.26498,,RESID:37@48,PSI-MOD:1458,,0
