PFR,UniProt Id,Entry Accession,Entry Description,Isoform Accession,Isoform Description,Isoform Sequence,Start,End,Length,Proteoform Sequence,Monoisotopic Mass,Average Mass,Sequence Modifications,PTMs,N-Terminal,C-Terminal,Star
14926,USMG5_HUMAN,Q96IX5,Up-regulated during skeletal muscle growth protein 5,Q96IX5,,MAGPESDAQYQFTGIKKYFNSYTLTGRMNCVLATYGSIALIVLYFKLRSKKTPAVKAT,1,57,57,AGPESDAQYQFTGIKKYFNSYTLTGRMNCVLATYGSIALIVLYFKLRSKKTPAVKAT,6322.33258469,6326.37938,,,,,1
14927,USMG5_HUMAN,Q96IX5,Up-regulated during skeletal muscle growth protein 5,Q96IX5,,MAGPESDAQYQFTGIKKYFNSYTLTGRMNCVLATYGSIALIVLYFKLRSKKTPAVKAT,0,57,58,MAGPESDAQYQFTGIKKYFNSYTLTGRMNCVLATYGSIALIVLYFKLRSKKTPAVKAT,6453.37307469,6457.57198,,,,,1
14928,USMG5_HUMAN,Q96IX5,Up-regulated during skeletal muscle growth protein 5,Q96IX5,,MAGPESDAQYQFTGIKKYFNSYTLTGRMNCVLATYGSIALIVLYFKLRSKKTPAVKAT,1,57,57,AGPESDAQYQFTGIKKYFNSYTLTGRMNCVLATYGSIALIVLYFKLRSKKTPAVKAT,6406.35371469,6410.45938,,RESID:55@14|RESID:55@15,,,1
14929,USMG5_HUMAN,Q96IX5,Up-regulated during skeletal muscle growth protein 5,Q96IX5,,MAGPESDAQYQFTGIKKYFNSYTLTGRMNCVLATYGSIALIVLYFKLRSKKTPAVKAT,1,57,57,AGPESDAQYQFTGIKKYFNSYTLTGRMNCVLATYGSIALIVLYFKLRSKKTPAVKAT,6364.34314969,6368.41938,,RESID:55@14,,,1
14930,USMG5_HUMAN,Q96IX5,Up-regulated during skeletal muscle growth protein 5,Q96IX5,,MAGPESDAQYQFTGIKKYFNSYTLTGRMNCVLATYGSIALIVLYFKLRSKKTPAVKAT,1,57,57,AGPESDAQYQFTGIKKYFNSYTLTGRMNCVLATYGSIALIVLYFKLRSKKTPAVKAT,6364.34314969,6368.41938,,RESID:41@0,,,1
14931,USMG5_HUMAN,Q96IX5,Up-regulated during skeletal muscle growth protein 5,Q96IX5,,MAGPESDAQYQFTGIKKYFNSYTLTGRMNCVLATYGSIALIVLYFKLRSKKTPAVKAT,0,57,58,MAGPESDAQYQFTGIKKYFNSYTLTGRMNCVLATYGSIALIVLYFKLRSKKTPAVKAT,6495.38363969,6499.61198,,RESID:49@0,,,1
14932,USMG5_HUMAN,Q96IX5,Up-regulated during skeletal muscle growth protein 5,Q96IX5,,MAGPESDAQYQFTGIKKYFNSYTLTGRMNCVLATYGSIALIVLYFKLRSKKTPAVKAT,1,57,57,AGPESDAQYQFTGIKKYFNSYTLTGRMNCVLATYGSIALIVLYFKLRSKKTPAVKAT,6364.34314969,6368.41938,,RESID:55@15,,,1
14933,USMG5_HUMAN,Q96IX5,Up-regulated during skeletal muscle growth protein 5,Q96IX5,,MAGPESDAQYQFTGIKKYFNSYTLTGRMNCVLATYGSIALIVLYFKLRSKKTPAVKAT,0,57,58,MAGPESDAQYQFTGIKKYFNSYTLTGRMNCVLATYGSIALIVLYFKLRSKKTPAVKAT,6495.38363969,6499.61198,,RESID:55@15,,,1
